{"text_format":"1","workbook":"xlsx","n_sheets":13,"sheets":["Summary","NARTY & WIAZANIA","BUTY","KASKI","GOGLE","KIJE","TORBY","ODZIEŻ RACE","Definition","PriceTable","Template","ColorTable","AddressList"],"not_rendered":{"charts":0,"images":3,"macros":1,"external_links":0,"defined_names":207,"comments":0,"pivot_tables":0},"unopened":[],"bounds":{"document_bytes":16777216,"sheet_cells":100000,"rows_first":2000,"rows_last":500,"rows_between":2000,"halvings":0,"cell_chars":16384,"cell_head_chars":4096},"cells_cut":0,"cells_raw":0,"read":"whole","date_system":"1900"}

{"sheet":"Summary","index":0,"n_rows":140,"n_cols":35,"rows_kept":140,"cut":false,"hidden":false,"merged":[[131,9,131,11],[125,9,125,11],[126,9,126,11],[127,9,127,11],[128,9,128,11],[129,9,129,11],[130,9,130,11],[119,9,119,11],[120,9,120,11],[121,9,121,11],[122,9,122,11],[123,9,123,11],[124,9,124,11],[113,9,113,11],[114,9,114,11],[115,9,115,11],[116,9,116,11],[117,9,117,11],[118,9,118,11],[107,9,107,11],[108,9,108,11],[109,9,109,11],[110,9,110,11],[111,9,111,11],[112,9,112,11],[101,9,101,11],[102,9,102,11],[103,9,103,11],[104,9,104,11],[105,9,105,11],[106,9,106,11],[95,9,95,11],[96,9,96,11],[97,9,97,11],[98,9,98,11],[99,9,99,11],[100,9,100,11],[89,9,89,11],[90,9,90,11],[91,9,91,11],[92,9,92,11],[93,9,93,11],[94,9,94,11],[83,9,83,11],[84,9,84,11],[85,9,85,11],[86,9,86,11],[87,9,87,11],[88,9,88,11],[77,9,77,11],[78,9,78,11],[79,9,79,11],[80,9,80,11],[81,9,81,11],[82,9,82,11],[71,9,71,11],[72,9,72,11],[73,9,73,11],[74,9,74,11],[75,9,75,11],[76,9,76,11],[65,9,65,11],[66,9,66,11],[67,9,67,11],[68,9,68,11],[69,9,69,11],[70,9,70,11],[59,9,59,11],[60,9,60,11],[61,9,61,11],[62,9,62,11],[63,9,63,11],[64,9,64,11],[53,9,53,11],[54,9,54,11],[55,9,55,11],[56,9,56,11],[57,9,57,11],[58,9,58,11],[47,9,47,11],[48,9,48,11],[49,9,49,11],[50,9,50,11],[51,9,51,11],[52,9,52,11],[41,9,41,11],[42,9,42,11],[43,9,43,11],[44,9,44,11],[45,9,45,11],[46,9,46,11],[129,6,129,8],[130,6,130,8],[131,6,131,8],[34,9,34,11],[35,9,35,11],[36,9,36,11],[37,9,37,11],[38,9,38,11],[39,9,39,11],[40,9,40,11],[123,6,123,8],[124,6,124,8],[125,6,125,8],[126,6,126,8],[127,6,127,8],[128,6,128,8],[117,6,117,8],[118,6,118,8],[119,6,119,8],[120,6,120,8],[121,6,121,8],[122,6,122,8],[111,6,111,8],[112,6,112,8],[113,6,113,8],[114,6,114,8],[115,6,115,8],[116,6,116,8],[105,6,105,8],[106,6,106,8],[107,6,107,8],[108,6,108,8],[109,6,109,8],[110,6,110,8],[99,6,99,8],[100,6,100,8],[101,6,101,8],[102,6,102,8],[103,6,103,8],[104,6,104,8],[93,6,93,8],[94,6,94,8],[95,6,95,8],[96,6,96,8],[97,6,97,8],[98,6,98,8],[87,6,87,8],[88,6,88,8],[89,6,89,8],[90,6,90,8],[91,6,91,8],[92,6,92,8],[81,6,81,8],[82,6,82,8],[83,6,83,8],[84,6,84,8],[85,6,85,8],[86,6,86,8],[75,6,75,8],[76,6,76,8],[77,6,77,8],[78,6,78,8],[79,6,79,8],[80,6,80,8],[69,6,69,8],[70,6,70,8],[71,6,71,8],[72,6,72,8],[73,6,73,8],[74,6,74,8],[63,6,63,8],[64,6,64,8],[65,6,65,8],[66,6,66,8],[67,6,67,8],[68,6,68,8],[57,6,57,8],[58,6,58,8],[59,6,59,8],[60,6,60,8],[61,6,61,8],[62,6,62,8],[51,6,51,8],[52,6,52,8],[53,6,53,8],[54,6,54,8],[55,6,55,8],[56,6,56,8],[45,6,45,8],[46,6,46,8],[47,6,47,8],[48,6,48,8],[49,6,49,8],[50,6,50,8],[39,6,39,8],[40,6,40,8],[41,6,41,8],[42,6,42,8],[43,6,43,8],[44,6,44,8],[127,3,127,5],[128,3,128,5],[129,3,129,5],[130,3,130,5],[131,3,131,5],[34,6,34,8],[35,6,35,8],[36,6,36,8],[37,6,37,8],[38,6,38,8],[121,3,121,5],[122,3,122,5],[123,3,123,5],[124,3,124,5],[125,3,125,5],[126,3,126,5],[115,3,115,5],[116,3,116,5],[117,3,117,5],[118,3,118,5],[119,3,119,5],[120,3,120,5],[109,3,109,5],[110,3,110,5],[111,3,111,5],[112,3,112,5],[113,3,113,5],[114,3,114,5],[103,3,103,5],[104,3,104,5],[105,3,105,5],[106,3,106,5],[107,3,107,5],[108,3,108,5],[97,3,97,5],[98,3,98,5],[99,3,99,5],[100,3,100,5],[101,3,101,5],[102,3,102,5],[91,3,91,5],[92,3,92,5],[93,3,93,5],[94,3,94,5],[95,3,95,5],[96,3,96,5],[85,3,85,5],[86,3,86,5],[87,3,87,5],[88,3,88,5],[89,3,89,5],[90,3,90,5],[79,3,79,5],[80,3,80,5],[81,3,81,5],[82,3,82,5],[83,3,83,5],[84,3,84,5],[73,3,73,5],[74,3,74,5],[75,3,75,5],[76,3,76,5],[77,3,77,5],[78,3,78,5],[67,3,67,5],[68,3,68,5],[69,3,69,5],[70,3,70,5],[71,3,71,5],[72,3,72,5],[61,3,61,5],[62,3,62,5],[63,3,63,5],[64,3,64,5],[65,3,65,5],[66,3,66,5],[55,3,55,5],[56,3,56,5],[57,3,57,5],[58,3,58,5],[59,3,59,5],[60,3,60,5],[49,3,49,5],[50,3,50,5],[51,3,51,5],[52,3,52,5],[53,3,53,5],[54,3,54,5],[43,3,43,5],[44,3,44,5],[45,3,45,5],[46,3,46,5],[47,3,47,5],[48,3,48,5],[37,3,37,5],[38,3,38,5],[39,3,39,5],[40,3,40,5],[41,3,41,5],[42,3,42,5],[33,6,33,8],[33,3,33,5],[33,9,33,11],[34,3,34,5],[35,3,35,5],[36,3,36,5],[7,2,7,5],[8,2,8,5],[10,2,10,5],[28,10,28,11],[15,10,15,11],[9,9,9,11],[8,7,8,8],[8,10,8,11],[10,10,10,11],[27,10,27,11],[84,1,84,2],[24,9,24,11],[14,9,14,11],[19,9,19,11],[13,10,13,11],[16,10,16,11],[17,10,17,11],[18,10,18,11],[31,3,31,5],[55,1,55,2],[76,1,76,2],[81,1,81,2],[80,1,80,2],[83,1,83,2],[15,7,18,8],[18,2,18,5],[15,6,18,6],[77,1,77,2],[82,1,82,2],[78,1,78,2],[79,1,79,2],[75,1,75,2],[65,1,65,2],[51,1,51,2],[119,1,119,2],[28,2,28,3],[107,1,107,2],[105,1,105,2],[100,1,100,2],[101,1,101,2],[96,1,96,2],[93,1,93,2],[90,1,90,2],[102,1,102,2],[112,1,112,2],[89,1,89,2],[104,1,104,2],[108,1,108,2],[109,1,109,2],[131,1,131,2],[120,1,120,2],[121,1,121,2],[127,1,127,2],[123,1,123,2],[116,1,116,2],[126,1,126,2],[124,1,124,2],[130,1,130,2],[129,1,129,2],[128,1,128,2],[122,1,122,2],[115,1,115,2],[97,1,97,2],[94,1,94,2],[125,1,125,2],[118,1,118,2],[110,1,110,2],[106,1,106,2],[117,1,117,2],[73,1,73,2],[91,1,91,2],[103,1,103,2],[74,1,74,2],[92,1,92,2],[98,1,98,2],[95,1,95,2],[99,1,99,2],[85,1,85,2],[87,1,87,2],[59,1,59,2],[60,1,60,2],[61,1,61,2],[66,1,66,2],[113,1,113,2],[114,1,114,2],[111,1,111,2],[72,1,72,2],[88,1,88,2],[86,1,86,2],[71,1,71,2],[64,1,64,2],[62,1,62,2],[63,1,63,2],[48,1,48,2],[50,1,50,2],[67,1,67,2],[68,1,68,2],[69,1,69,2],[70,1,70,2],[37,1,37,2],[38,1,38,2],[53,1,53,2],[43,1,43,2],[58,1,58,2],[44,1,44,2],[57,1,57,2],[39,1,39,2],[52,1,52,2],[26,10,26,11],[21,10,21,11],[32,1,32,2],[47,1,47,2],[33,1,33,2],[42,1,42,2],[40,1,40,2],[41,1,41,2],[34,1,34,2],[35,1,35,2],[13,2,13,5],[31,6,31,8],[12,7,13,8],[15,2,15,5],[16,2,16,5],[17,2,17,5],[20,7,23,8],[135,6,135,8],[20,6,23,6],[25,2,25,4],[27,2,27,4],[49,1,49,2],[46,1,46,2],[36,1,36,2],[45,1,45,2],[54,1,54,2],[56,1,56,2],[9,7,9,8],[20,2,20,5],[21,2,21,5],[22,2,22,5],[23,2,23,5],[20,10,20,11],[22,10,22,11],[23,10,23,11],[10,7,10,8],[11,7,11,8],[11,10,11,11],[12,10,12,11],[32,6,32,8],[32,3,32,5],[32,9,32,11],[132,6,132,8],[132,9,132,11],[132,3,132,5],[31,9,31,11],[11,2,12,5]]}
[0,null,null,null,null,null,null,null,null,null,null,null,null,null,null,null,null,null,null,null,null,null,null,null,null,null,"FieldName","Value-Type","Value-Check","Option","Content from","Content to","Status","Content to","Status"]
[null,null,null,null,null,null,null,null,null,null,null,null,null,null,null,null,null,null,null,null,null,null,null,null,null,null,"F_DELDATE1","DATE","E",null,"Invalid date",null,"FINISHED","DATEFORMAT:31.12.2012","FINISHED"]
[null,"HEAD Sport GmbH - Wuhrkopfweg 1 ",null,null,null,null,"HEAD - FORMULARZ ZAMÓWIENIA 2024/2025",null,null,null,null,null,null,null,null,null,null,null,null,null,null,null,null,null,null,null,"F_DELDATE2","DATE","E",null,"Invalid date"]
["Catalog","Wuhrkopfweg 1 - A 6921 Kennelbach Austria",null,null,null,null,null,null,null,null,null,null,null,null,null,null,null,null,null,null,null,null,null,null,null,null,"F_DELDATE3","DATE","E",null,"Invalid date"]
["26PLRA2024","FN 64824 f",null,null,null,null,null,null,null,null,null,null,null,null,null,null,null,null,null,null,null,null,null,null,null,null,"F_DELDATE4","DATE","E",null,"Invalid date"]
["SalesOrg",null,null,null,null," ",null,null,null,null,null,null,null,null,null,null,null,null,null,null,null,null,null,null,null,null,"F_ORDER_DATE","DATE","E",null,"Invalid date"]
[2601,null,null,null,null,null,null,null,null,null,null,null,null,null,null,null,null,null,null,null,null,null,null,null,null,null,"#END#"]
["Country","Sales rep","2694000|Sales Rep / Poland"]
[null,"Nr klienta","NEW",null,null,null,"Nr zamówienia","PRE RACE 24/25",null,"Data zamówienia"]
[]
["Locked","Nazwa firmy",null,null,null,null,"Adres wysyłki","",null,"Data dostawy"]
[true,"Adres","",null,null,null,"Nazwa firmy",""]
[null,null,null,null,null,null,"Adres",""]
[null,"VAT-Number",null,null,null,null,"(jeśli inny) "]
["Email CS"]
[null,"Kontakt","",null,null,null,null,null,null,"Notatki"]
[null,null,""]
[null,"Telefon",""]
[null,"E-Mail"]
[]
[]
[]
[]
[]
[]
[null,null,null,null,null,null,"Valuta Date 1",null,null,"Fax:"]
[null,"Customer UID No.",null,null,null,null,"Valuta Date 2",null,null,"Deliver date 4"]
[null,"Speditions-Info",null,null,null,null,"Valuta Date 3",null,null,"Data dostawy 2"]
[null,"Payment Terms",null,null,null,null,"Valuta Date 4",null,null,"Data dostawy 3"]
[]
[null,{"$f":"A1","v":0},"Sheet(s) in DEV mode"]
["#SUM_HEADER",null,null,{"$f":"N_WS_NETSCALE_NAME","v":"Zniżka"},null,null,"Ilość",null,null,"Wartość"]
["#SUM_HEADER","Product line"]
[null,"NARTY & WIAZANIA",null,{"$f":"'NARTY & WIAZANIA'!$I$6","v":0},null,null,{"$f":"'NARTY & WIAZANIA'!A10","v":0},null,null,{"$f":"'NARTY & WIAZANIA'!B10","v":0}]
[null,"BUTY",null,{"$f":"BUTY!$I$6","v":0},null,null,{"$f":"BUTY!A10","v":0},null,null,{"$f":"BUTY!B10","v":0}]
[null,"KASKI",null,{"$f":"KASKI!$I$6","v":0},null,null,{"$f":"KASKI!A10","v":0},null,null,{"$f":"KASKI!B10","v":0}]
[null,"GOGLE",null,{"$f":"GOGLE!$I$6","v":0},null,null,{"$f":"GOGLE!A10","v":0},null,null,{"$f":"GOGLE!B10","v":0}]
[null,"KIJE",null,{"$f":"KIJE!$I$6","v":0},null,null,{"$f":"KIJE!A10","v":0},null,null,{"$f":"KIJE!B10","v":0}]
[null,"TORBY",null,{"$f":"TORBY!$I$6","v":0},null,null,{"$f":"TORBY!A10","v":0},null,null,{"$f":"TORBY!B10","v":0}]
[null,"ODZIEŻ RACE",null,{"$f":"'ODZIEŻ RACE'!$I$6","v":0},null,null,{"$f":"'ODZIEŻ RACE'!A10","v":0},null,null,{"$f":"'ODZIEŻ RACE'!B10","v":0}]
[]
[]
[]
[]
[]
[]
[]
[]
[]
[]
[]
[]
[]
[]
[]
[]
[]
[]
[]
[]
[]
[]
[]
[]
[]
[]
[]
[]
[]
[]
[]
[]
[]
[]
[]
[]
[]
[]
[]
[]
[]
[]
[]
[]
[]
[]
[]
[]
[]
[]
[]
[]
[]
[]
[]
[]
[]
[]
[]
[]
[]
[]
[]
[]
[]
[]
[]
[]
[]
[]
[]
[]
[]
[]
[]
[]
[]
[]
[]
[]
[]
[]
[]
[]
[]
[]
[]
[]
[]
[]
[]
[]
["#SUM_TOTAL","Total",null,null,null,null,{"$f":"SUM(G34:G132)","v":0},null,null,{"$f":"SUM(J34:J132)","v":0}]
[]
[]
[null,"Total",null,null,null,null,{"$f":"SUM(G133:I133)","v":0},null,null,{"$f":"SUM(J133:L133)","v":0},null,"PLN"]
[]
[]
[]
[null,null,null,null,null,null,null,null,null,null,null,"Version",1]

{"sheet":"NARTY & WIAZANIA","index":1,"n_rows":78,"n_cols":56,"rows_kept":78,"cut":false,"hidden":false,"merged":[[3,6,3,7],[3,8,3,14],[3,15,3,18],[3,19,3,22],[5,6,5,7],[5,8,5,14],[5,15,5,18],[5,19,5,22],[2,3,2,5],[2,6,2,7],[2,8,2,14],[2,15,2,18],[2,19,2,22],[3,3,3,5],[6,3,6,5],[6,8,6,14],[6,15,6,18],[6,19,6,22],[9,5,9,17],[4,3,5,5],[4,6,4,7],[4,8,4,14],[4,15,4,18],[4,19,4,22]]}
["#PRD","#INPUT","http://www.head.com/",null,{"$f":"'NARTY & WIAZANIA'!D1","v":0},null,null,"#DD1","#DD1","#DD1","#DD1","#DD1","#DD1","#DD1","#DD1","#DD1","#DD1","#DD1","#DD1","#DD1","#DD1",null,null,null,null,null,null,null,null,"#FIRST-ADDINFO-COL"]
[{"$f":"SUM(A10:A10)","v":0},{"$f":"SUM(B10:B10)","v":0},"   ",null,"   "]
["B3 has to be empty!!!",null,"Nr klienta",{"$f":"IF(F_CUST_NO=\"\",\"\",F_CUST_NO)","v":"NEW"},null,null,"Nr zamówienia",null,{"$f":"IF(F_ORDER_NO=\"\",\"\",F_ORDER_NO)","v":"PRE RACE 24/25"},null,null,null,null,null,null,"Data zamówienia",null,null,null,{"$f":"IF(F_ORDER_DATE<> \"\",F_ORDER_DATE,\"\")","v":""}]
["Empty Lines:",true,"Nazwa firmy",{"$f":"IF(F_CUST_NAME=\"\",\"\",F_CUST_NAME)","v":""},null,null,"Sales Rep.",null,{"$f":"IF(F_SALES_REP=\"\",\"\",F_SALES_REP)","v":"2694000|Sales Rep / Poland"},null,null,null,null,null,null,"Data dostawy",null,null,null,{"$f":"IF(F_DELDATE1<> \"\",F_DELDATE1,\"\")","v":""}]
["Delivery Date Total:",true,"Adres",{"$f":"IF(F_CUST_ADDR=\"\",\"\",F_CUST_ADDR)","v":""},null,null,null,null,null,null,null,null,null,null,null,null,null,null,null,{"$f":"IF(F_DELDATE2<> \"\",F_DELDATE2,\"\")","v":""}]
["Delivery Date 1:",true,"   ",null,null,null,"Zniżka",null,null,null,null,null,null,null,null,null,null,null,null,{"$f":"IF(F_DELDATE3<> \"\",F_DELDATE3,\"\")","v":""}]
["Delivery Date 2:",true]
["Delivery Date 3:",true]
[null,null,"HEAD Sport GmbH - Wuhrkopfweg 1 "]
[{"$f":"SUM($V$20:$V$25)+SUM($V$28:$V$29)+SUM($V$33:$V$43)+SUM($V$47:$V$51)+SUM($V$53:$V$62)+SUM($V$65:$V$67)+SUM($V$70:$V$78)","v":0},{"$f":"SUM($Z$20:$Z$25)+SUM($Z$28:$Z$29)+SUM($Z$33:$Z$43)+SUM($Z$47:$Z$51)+SUM($Z$53:$Z$62)+SUM($Z$65:$Z$67)+SUM($Z$70:$Z$78)","v":0},"Wuhrkopfweg 1 - A 6921 Kennelbach Austria",null,null,"NARTY & WIAZANIA -kod prod. to link do zdjęcia!"]
["Reserved DD2-QTTY","DD2-Amount","FN 64824 f"]
["Reserved DD3-QTTY","DD3-Amount"]
["Reserved DD4-QTTY","DD4-Amount"]
["Reserved DD5-QTTY","DD5-Amount"]
["Reserved DD6-QTTY","DD6-Amount"]
[]
["GH","N:52|","NARTY HEAD"]
["GH","N:29|","GS/SL"]
["H","N:29.1|29","Kod Art.",null,"Model","Cena Racing Netto","Cena Racing Brutto","151","156","158","165","168","176","177","181","183","186","188","189","191","193","Ilość","Rekomend. Cena Detaliczna","NET-Price","Price incl. VAT","Wartość","Uwagi"]
[null,"N:29.1|29",313003,null,"WCR e-GS Rebel FIS SW RP WCR 14",2276.42,{"$f":"F20 * 1.23","v":2799.9965999999999},null,null,null,null,null,null,null,null,null,null,null,null,null,null,{"$f":"(SUM(H20:U20))","v":0},4000,{"$f":"Y20 / 1.23","v":2276.42},{"$f":"G20 * (1-WS_DISCOUNT)","v":2799.9965999999999},{"$f":"((SUM(H20:U20)) * Y20)","v":0},null,null,null,null,null,"#ART","#MATKZ",null,null,null,null,null,null,null,null,null,null,null,"#DIM-183",null,"#DIM-188",null,null,"#DIM-193","#POSMENGE",null,"#PREIS-2276.42",null,"#POSWERT","#BEMERKUNG"]
[null,"N:29.1|29",313063,null,"WCR e-GS Rebel Pro SW RP WCR 14 wh/bk",2276.42,2799.9965999999999,null,null,null,null,null,null,null,null,null,null,null,null,null,null,0,4000,2276.42,2799.9965999999999,0,null,null,null,null,null,"#ART","#MATKZ",null,null,null,null,null,null,null,null,null,"#DIM-177",null,"#DIM-183",null,null,"#DIM-189","#DIM-191",null,"#POSMENGE",null,"#PREIS-2276.42",null,"#POSWERT","#BEMERKUNG"]
[null,"N:29.1|29",313043,null,"WCR e-GS Rebel SW RP WCR 14 wh/bk",2276.42,2799.9965999999999,null,null,null,null,null,null,null,null,null,null,null,null,null,null,0,4000,2276.42,2799.9965999999999,0,null,null,null,null,null,"#ART","#MATKZ",null,null,null,null,null,null,null,null,"#DIM-176",null,"#DIM-181",null,"#DIM-186","#DIM-188",null,null,null,"#POSMENGE",null,"#PREIS-2276.42",null,"#POSWERT","#BEMERKUNG"]
[null,"N:29.1|29",313053,null,"WCR e-GS Rebel SW RP WCR T wh/bk",2048.7800000000002,2519.9994000000002,null,null,null,null,null,null,null,null,null,null,null,null,null,null,0,3600,2048.7800000000002,2519.9994000000002,0,null,null,null,null,null,"#ART","#MATKZ",null,null,null,null,null,null,null,null,"#DIM-176",null,"#DIM-181",null,null,null,null,null,null,"#POSMENGE",null,"#PREIS-2048.78",null,"#POSWERT","#BEMERKUNG"]
[null,"N:29.1|29",313024,null,"WCR e-SL Rebel SW RP WCR 14 wh/bk",2276.42,2799.9965999999999,null,null,null,null,null,null,null,null,null,null,null,null,null,null,0,4000,2276.42,2799.9965999999999,0,null,null,null,null,null,"#ART","#MATKZ",null,null,null,"#DIM-151",null,null,null,null,null,null,null,null,null,null,null,null,null,"#POSMENGE",null,"#PREIS-2276.42",null,"#POSWERT","#BEMERKUNG"]
[null,"N:29.1|29",313084,null,"WCR e-SL Rebel FIS SW RP WCR 14 wh/bk",2276.42,2799.9965999999999,null,null,null,null,null,null,null,null,null,null,null,null,null,null,0,4000,2276.42,2799.9965999999999,0,null,null,null,null,null,"#ART","#MATKZ",null,null,null,null,"#DIM-156","#DIM-158","#DIM-165","#DIM-168",null,null,null,null,null,null,null,null,null,"#POSMENGE",null,"#PREIS-2276.42",null,"#POSWERT","#BEMERKUNG"]
["GH","N:30|","Junior Racing"]
["H","N:30.1|30","Kod Art.",null,"Model","Cena Racing Netto","Cena Racing Brutto","116","118","124","125","132","139","140","146","148","153","156","160","164","172","Ilość","Rekomend. Cena Detaliczna","NET-Price","Price incl. VAT","Wartość","Uwagi"]
[null,"N:30.1|30",314234,null,"WCR e.SL Rebel Team SW RP WCR T wh/bk",1052.8499999999999,{"$f":"F28 * 1.23","v":1295.0054999999998},null,null,null,null,null,null,null,null,null,null,null,null,null,null,{"$f":"(SUM(H28:U28))","v":0},1850,{"$f":"Y28 / 1.23","v":1052.8499999999999},{"$f":"G28 * (1-WS_DISCOUNT)","v":1295.0054999999998},{"$f":"((SUM(H28:U28)) * Y28)","v":0},null,null,null,null,null,"#ART","#MATKZ",null,null,null,null,"#DIM-118",null,"#DIM-125","#DIM-132","#DIM-139",null,"#DIM-146",null,"#DIM-153",null,"#DIM-160",null,null,"#POSMENGE",null,"#PREIS-1052.85",null,"#POSWERT","#BEMERKUNG"]
[null,"N:30.1|30",314004,null,"WCR e.GS Rebel Team SW RP WCR T wh/bk",1052.8499999999999,{"$f":"F29 * 1.23","v":1295.0054999999998},null,null,null,null,null,null,null,null,null,null,null,null,null,null,{"$f":"(SUM(H29:U29))","v":0},1850,{"$f":"Y29 / 1.23","v":1052.8499999999999},{"$f":"G29 * (1-WS_DISCOUNT)","v":1295.0054999999998},{"$f":"((SUM(H29:U29)) * Y29)","v":0},null,null,null,null,null,"#ART","#MATKZ",null,null,null,"#DIM-116",null,"#DIM-124",null,"#DIM-132",null,"#DIM-140",null,"#DIM-148",null,"#DIM-156",null,"#DIM-164","#DIM-172","#POSMENGE",null,"#PREIS-1052.85",null,"#POSWERT","#BEMERKUNG"]
["GH","N:31|","WIAZANIA HEAD"]
["GH","N:32|","Head Comp./Racing"]
["H","N:32.1|32","Kod Art.",null,"Model","Cena Racing Netto","Cena Racing Brutto","QTY","","","","","","","","","","","","","","Ilość","Rekomend. Cena Detaliczna","NET-Price","Price incl. VAT","Wartość","Uwagi"]
[null,"N:32.1|32",100900,null,"FREEFLEX ST 20X RD BR.85 [A]m.bk/sp.bl",1138.21,{"$f":"F33 * 1.23","v":1399.9983},null,null,null,null,null,null,null,null,null,null,null,null,null,null,{"$f":"(SUM(H33:U33))","v":0},2000,{"$f":"Y33 / 1.23","v":1138.21},{"$f":"G33 * (1-WS_DISCOUNT)","v":1399.9983},{"$f":"((SUM(H33:U33)) * Y33)","v":0},null,null,null,null,null,"#ART","#MATKZ",null,null,null,"#DIM-QTY",null,null,null,null,null,null,null,null,null,null,null,null,null,"#POSMENGE",null,"#PREIS-1138.21",null,"#POSWERT","#BEMERKUNG"]
[null,"N:32.1|32",100901,null,"FREEFLEX ST 20X RS BR.85 [A]m.bk/sp.bl",1138.21,1399.9983,null,null,null,null,null,null,null,null,null,null,null,null,null,null,0,2000,1138.21,1399.9983,0,null,null,null,null,null,"#ART","#MATKZ",null,null,null,"#DIM-QTY",null,null,null,null,null,null,null,null,null,null,null,null,null,"#POSMENGE",null,"#PREIS-1138.21",null,"#POSWERT","#BEMERKUNG"]
[null,"N:32.1|32",100902,null,"FREEFLEX ST 16X RD BR.85 [A]m.bk/sp.bl",1138.21,1399.9983,null,null,null,null,null,null,null,null,null,null,null,null,null,null,0,2000,1138.21,1399.9983,0,null,null,null,null,null,"#ART","#MATKZ",null,null,null,"#DIM-QTY",null,null,null,null,null,null,null,null,null,null,null,null,null,"#POSMENGE",null,"#PREIS-1138.21",null,"#POSWERT","#BEMERKUNG"]
[null,"N:32.1|32",100903,null,"FREEFLEX ST 14X BR.85 [A]m.bk/sp.bl",882.11,1084.9953,null,null,null,null,null,null,null,null,null,null,null,null,null,null,0,1550,882.11,1084.9953,0,null,null,null,null,null,"#ART","#MATKZ",null,null,null,"#DIM-QTY",null,null,null,null,null,null,null,null,null,null,null,null,null,"#POSMENGE",null,"#PREIS-882.11",null,"#POSWERT","#BEMERKUNG"]
[null,"N:32.1|32",100904,null,"FREEFLEX ST 16 BR.85 [A]m.bk/sp.bl",825.2,1014.9960000000001,null,null,null,null,null,null,null,null,null,null,null,null,null,null,0,1450,825.2,1014.9960000000001,0,null,null,null,null,null,"#ART","#MATKZ",null,null,null,"#DIM-QTY",null,null,null,null,null,null,null,null,null,null,null,null,null,"#POSMENGE",null,"#PREIS-825.2",null,"#POSWERT","#BEMERKUNG"]
[null,"N:32.1|32",100905,null,"FREEFLEX ST 14 BR.85 [A]m.bk/sp.bl",711.38,874.99739999999997,null,null,null,null,null,null,null,null,null,null,null,null,null,null,0,1250,711.38,874.99739999999997,0,null,null,null,null,null,"#ART","#MATKZ",null,null,null,"#DIM-QTY",null,null,null,null,null,null,null,null,null,null,null,null,null,"#POSMENGE",null,"#PREIS-711.38",null,"#POSWERT","#BEMERKUNG"]
[null,"N:32.1|32",100906,null,"FREEFLEX 11 RACE BR.85 [A]m.bk/sp.bl",455.28,559.99439999999993,null,null,null,null,null,null,null,null,null,null,null,null,null,null,0,800,455.28,559.99439999999993,0,null,null,null,null,null,"#ART","#MATKZ",null,null,null,"#DIM-QTY",null,null,null,null,null,null,null,null,null,null,null,null,null,"#POSMENGE",null,"#PREIS-455.28",null,"#POSWERT","#BEMERKUNG"]
[null,"N:32.1|32",100907,null,"FREEFLEX 14 GW BR.85 [D]m.bk/sp.bl",597.55999999999995,734.99879999999996,null,null,null,null,null,null,null,null,null,null,null,null,null,null,0,1050,597.55999999999995,734.99879999999996,0,null,null,null,null,null,"#ART","#MATKZ",null,null,null,"#DIM-QTY",null,null,null,null,null,null,null,null,null,null,null,null,null,"#POSMENGE",null,"#PREIS-597.56",null,"#POSWERT","#BEMERKUNG"]
[null,"N:32.1|32",100908,null,"FREEFLEX 11 GW BR.85 [D]m.bk/sp.bl",426.83,525.0009,null,null,null,null,null,null,null,null,null,null,null,null,null,null,0,750,426.83,525.0009,0,null,null,null,null,null,"#ART","#MATKZ",null,null,null,"#DIM-QTY",null,null,null,null,null,null,null,null,null,null,null,null,null,"#POSMENGE",null,"#PREIS-426.83",null,"#POSWERT","#BEMERKUNG"]
[null,"N:32.1|32",100921,null,"EVO 9 GW CA BR.85[D]s.bk/sp.bl",313.01,385.00229999999999,null,null,null,null,null,null,null,null,null,null,null,null,null,null,0,550,313.01,385.00229999999999,0,null,null,null,null,null,"#ART","#MATKZ",null,null,null,"#DIM-QTY",null,null,null,null,null,null,null,null,null,null,null,null,null,"#POSMENGE",null,"#PREIS-313.01",null,"#POSWERT","#BEMERKUNG"]
[null,"N:32.1|32",100909,null,"FREEFLEX DEMO 14 GW BR.85 [D]m.bk/sp.bl",711.38,874.99739999999997,null,null,null,null,null,null,null,null,null,null,null,null,null,null,0,1250,711.38,874.99739999999997,0,null,null,null,null,null,"#ART","#MATKZ",null,null,null,"#DIM-QTY",null,null,null,null,null,null,null,null,null,null,null,null,null,"#POSMENGE",null,"#PREIS-711.38",null,"#POSWERT","#BEMERKUNG"]
["GH","N:61|","Części"]
["H","N:61.1|61","Kod Art.",null,"Model","Cena Racing Netto","Cena Racing Brutto","QTY","","","","","","","","","","","","","","Ilość","Rekomend. Cena Detaliczna","NET-Price","Price incl. VAT","Wartość","Uwagi"]
["T","N:61.1|61",null,null,"Skistopery"]
[null,"N:61.1|61",163032,null,"Power Brake2 Race PRO 16-85 [A] (1 pair)",56.91,{"$f":"F47 * 1.23","v":69.999299999999991},null,null,null,null,null,null,null,null,null,null,null,null,null,null,{"$f":"(SUM(H47:U47))","v":0},100,{"$f":"Y47 / 1.23","v":56.91},{"$f":"G47 * (1-WS_DISCOUNT)","v":69.999299999999991},{"$f":"((SUM(H47:U47)) * Y47)","v":0},null,null,null,null,null,"#ART","#MATKZ",null,null,null,"#DIM-QTY",null,null,null,null,null,null,null,null,null,null,null,null,null,"#POSMENGE",null,"#PREIS-56.91",null,"#POSWERT","#BEMERKUNG"]
[null,"N:61.1|61",163033,null,"Power Brake2 Race PRO 17-85 [A] (1 pair)",56.91,{"$f":"F48 * 1.23","v":69.999299999999991},null,null,null,null,null,null,null,null,null,null,null,null,null,null,{"$f":"(SUM(H48:U48))","v":0},100,{"$f":"Y48 / 1.23","v":56.91},{"$f":"G48 * (1-WS_DISCOUNT)","v":69.999299999999991},{"$f":"((SUM(H48:U48)) * Y48)","v":0},null,null,null,null,null,"#ART","#MATKZ",null,null,null,"#DIM-QTY",null,null,null,null,null,null,null,null,null,null,null,null,null,"#POSMENGE",null,"#PREIS-56.91",null,"#POSWERT","#BEMERKUNG"]
[null,"N:61.1|61",163034,null,"Power Brake2 Race PRO wide 18-85[A](1pr)",56.91,{"$f":"F49 * 1.23","v":69.999299999999991},null,null,null,null,null,null,null,null,null,null,null,null,null,null,{"$f":"(SUM(H49:U49))","v":0},100,{"$f":"Y49 / 1.23","v":56.91},{"$f":"G49 * (1-WS_DISCOUNT)","v":69.999299999999991},{"$f":"((SUM(H49:U49)) * Y49)","v":0},null,null,null,null,null,"#ART","#MATKZ",null,null,null,"#DIM-QTY",null,null,null,null,null,null,null,null,null,null,null,null,null,"#POSMENGE",null,"#PREIS-56.91",null,"#POSWERT","#BEMERKUNG"]
[null,"N:61.1|61",163039,null,"Power Brake2 Race PRO 18-85 [A] (1 pair)",56.91,{"$f":"F50 * 1.23","v":69.999299999999991},null,null,null,null,null,null,null,null,null,null,null,null,null,null,{"$f":"(SUM(H50:U50))","v":0},100,{"$f":"Y50 / 1.23","v":56.91},{"$f":"G50 * (1-WS_DISCOUNT)","v":69.999299999999991},{"$f":"((SUM(H50:U50)) * Y50)","v":0},null,null,null,null,null,"#ART","#MATKZ",null,null,null,"#DIM-QTY",null,null,null,null,null,null,null,null,null,null,null,null,null,"#POSMENGE",null,"#PREIS-56.91",null,"#POSWERT","#BEMERKUNG"]
[null,"N:61.1|61",163044,null,"Power Brake2 LD 85 [D] (1 pair)",56.91,{"$f":"F51 * 1.23","v":69.999299999999991},null,null,null,null,null,null,null,null,null,null,null,null,null,null,{"$f":"(SUM(H51:U51))","v":0},100,{"$f":"Y51 / 1.23","v":56.91},{"$f":"G51 * (1-WS_DISCOUNT)","v":69.999299999999991},{"$f":"((SUM(H51:U51)) * Y51)","v":0},null,null,null,null,null,"#ART","#MATKZ",null,null,null,"#DIM-QTY",null,null,null,null,null,null,null,null,null,null,null,null,null,"#POSMENGE",null,"#PREIS-56.91",null,"#POSWERT","#BEMERKUNG"]
["T","N:61.1|61",null,null,"Zestawy lifterów"]
[null,"N:61.1|61",162905,null,"lifter set 3mm (1 Set)",56.91,{"$f":"F53 * 1.23","v":69.999299999999991},null,null,null,null,null,null,null,null,null,null,null,null,null,null,{"$f":"(SUM(H53:U53))","v":0},100,{"$f":"Y53 / 1.23","v":56.91},{"$f":"G53 * (1-WS_DISCOUNT)","v":69.999299999999991},{"$f":"((SUM(H53:U53)) * Y53)","v":0},null,null,null,null,null,"#ART","#MATKZ",null,null,null,"#DIM-QTY",null,null,null,null,null,null,null,null,null,null,null,null,null,"#POSMENGE",null,"#PREIS-56.91",null,"#POSWERT","#BEMERKUNG"]
[null,"N:61.1|61",162906,null,"lifter set 5mm (1 Set)",56.91,69.999299999999991,null,null,null,null,null,null,null,null,null,null,null,null,null,null,0,100,56.91,69.999299999999991,0,null,null,null,null,null,"#ART","#MATKZ",null,null,null,"#DIM-QTY",null,null,null,null,null,null,null,null,null,null,null,null,null,"#POSMENGE",null,"#PREIS-56.91",null,"#POSWERT","#BEMERKUNG"]
[null,"N:61.1|61",162933,null,"lifter set 3/5mm (heel/toe) (1 Set)",56.91,69.999299999999991,null,null,null,null,null,null,null,null,null,null,null,null,null,null,0,100,56.91,69.999299999999991,0,null,null,null,null,null,"#ART","#MATKZ",null,null,null,"#DIM-QTY",null,null,null,null,null,null,null,null,null,null,null,null,null,"#POSMENGE",null,"#PREIS-56.91",null,"#POSWERT","#BEMERKUNG"]
[null,"N:61.1|61",162934,null,"lifter set 4/6mm (heel/toe) (1 Set)",56.91,69.999299999999991,null,null,null,null,null,null,null,null,null,null,null,null,null,null,0,100,56.91,69.999299999999991,0,null,null,null,null,null,"#ART","#MATKZ",null,null,null,"#DIM-QTY",null,null,null,null,null,null,null,null,null,null,null,null,null,"#POSMENGE",null,"#PREIS-56.91",null,"#POSWERT","#BEMERKUNG"]
[null,"N:61.1|61",163075,null,"lifter set 2/3mm (heel/toe) (1 Set)",56.91,69.999299999999991,null,null,null,null,null,null,null,null,null,null,null,null,null,null,0,100,56.91,69.999299999999991,0,null,null,null,null,null,"#ART","#MATKZ",null,null,null,"#DIM-QTY",null,null,null,null,null,null,null,null,null,null,null,null,null,"#POSMENGE",null,"#PREIS-56.91",null,"#POSWERT","#BEMERKUNG"]
[null,"N:61.1|61",163076,null,"lifter set 5/8mm (heel/toe) (1 Set)",56.91,69.999299999999991,null,null,null,null,null,null,null,null,null,null,null,null,null,null,0,100,56.91,69.999299999999991,0,null,null,null,null,null,"#ART","#MATKZ",null,null,null,"#DIM-QTY",null,null,null,null,null,null,null,null,null,null,null,null,null,"#POSMENGE",null,"#PREIS-56.91",null,"#POSWERT","#BEMERKUNG"]
[null,"N:61.1|61",163135,null,"lifter set 1/2mm (heel/toe) (1 Set)",56.91,69.999299999999991,null,null,null,null,null,null,null,null,null,null,null,null,null,null,0,100,56.91,69.999299999999991,0,null,null,null,null,null,"#ART","#MATKZ",null,null,null,"#DIM-QTY",null,null,null,null,null,null,null,null,null,null,null,null,null,"#POSMENGE",null,"#PREIS-56.91",null,"#POSWERT","#BEMERKUNG"]
[null,"N:61.1|61",163136,null,"lifter set 4/5mm (heel/toe) (1 Set)",56.91,69.999299999999991,null,null,null,null,null,null,null,null,null,null,null,null,null,null,0,100,56.91,69.999299999999991,0,null,null,null,null,null,"#ART","#MATKZ",null,null,null,"#DIM-QTY",null,null,null,null,null,null,null,null,null,null,null,null,null,"#POSMENGE",null,"#PREIS-56.91",null,"#POSWERT","#BEMERKUNG"]
[null,"N:61.1|61",163187,null,"lifter set 5/6mm (heel/toe) (1 set)",56.91,69.999299999999991,null,null,null,null,null,null,null,null,null,null,null,null,null,null,0,100,56.91,69.999299999999991,0,null,null,null,null,null,"#ART","#MATKZ",null,null,null,"#DIM-QTY",null,null,null,null,null,null,null,null,null,null,null,null,null,"#POSMENGE",null,"#PREIS-56.91",null,"#POSWERT","#BEMERKUNG"]
[null,"N:61.1|61",162803,null,"Heel AFD Insert Freeflex PRO (10 prs.)",28.46,35.005800000000001,null,null,null,null,null,null,null,null,null,null,null,null,null,null,0,50,28.46,35.005800000000001,0,null,null,null,null,null,"#ART","#MATKZ",null,null,null,"#DIM-QTY",null,null,null,null,null,null,null,null,null,null,null,null,null,"#POSMENGE",null,"#PREIS-28.46",null,"#POSWERT","#BEMERKUNG"]
["GH","N:53|","Downhill"]
["H","N:53.1|53","Kod Art.",null,"Model","Cena Racing Netto","Cena Racing Brutto","210","215","218","","","","","","","","","","","","Ilość","Rekomend. Cena Detaliczna","NET-Price","Price incl. VAT","Wartość","Uwagi"]
[null,"N:53.1|53",318003,null,"DH 218 Race Plate",2390.2399999999998,{"$f":"F65 * 1.23","v":2939.9951999999998},null,null,null,null,null,null,null,null,null,null,null,null,null,null,{"$f":"(SUM(H65:U65))","v":0},4200,{"$f":"Y65 / 1.23","v":2390.2399999999998},{"$f":"G65 * (1-WS_DISCOUNT)","v":2939.9951999999998},{"$f":"((SUM(H65:U65)) * Y65)","v":0},null,null,null,null,null,"#ART","#MATKZ",null,null,null,null,null,"#DIM-218",null,null,null,null,null,null,null,null,null,null,null,"#POSMENGE",null,"#PREIS-2390.24",null,"#POSWERT","#BEMERKUNG"]
[null,"N:53.1|53",318013,null,"DH 215 Race Plate",2390.2399999999998,{"$f":"F66 * 1.23","v":2939.9951999999998},null,null,null,null,null,null,null,null,null,null,null,null,null,null,{"$f":"(SUM(H66:U66))","v":0},4200,{"$f":"Y66 / 1.23","v":2390.2399999999998},{"$f":"G66 * (1-WS_DISCOUNT)","v":2939.9951999999998},{"$f":"((SUM(H66:U66)) * Y66)","v":0},null,null,null,null,null,"#ART","#MATKZ",null,null,null,null,"#DIM-215",null,null,null,null,null,null,null,null,null,null,null,null,"#POSMENGE",null,"#PREIS-2390.24",null,"#POSWERT","#BEMERKUNG"]
[null,"N:53.1|53",318023,null,"DH 210 Race Plate",2390.2399999999998,{"$f":"F67 * 1.23","v":2939.9951999999998},null,null,null,null,null,null,null,null,null,null,null,null,null,null,{"$f":"(SUM(H67:U67))","v":0},4200,{"$f":"Y67 / 1.23","v":2390.2399999999998},{"$f":"G67 * (1-WS_DISCOUNT)","v":2939.9951999999998},{"$f":"((SUM(H67:U67)) * Y67)","v":0},null,null,null,null,null,"#ART","#MATKZ",null,null,null,"#DIM-210",null,null,null,null,null,null,null,null,null,null,null,null,null,"#POSMENGE",null,"#PREIS-2390.24",null,"#POSWERT","#BEMERKUNG"]
["GH","N:28|","Super-G"]
["H","N:28.1|28","Kod Art.",null,"Model","Cena Racing Netto","Cena Racing Brutto","175","185","195","200","202","207","210","213","","","","","","","Ilość","Rekomend. Cena Detaliczna","NET-Price","Price incl. VAT","Wartość","Uwagi"]
[null,"N:28.1|28",318033,null,"SGM 213 Race Plate",2390.2399999999998,{"$f":"F70 * 1.23","v":2939.9951999999998},null,null,null,null,null,null,null,null,null,null,null,null,null,null,{"$f":"(SUM(H70:U70))","v":0},4200,{"$f":"Y70 / 1.23","v":2390.2399999999998},{"$f":"G70 * (1-WS_DISCOUNT)","v":2939.9951999999998},{"$f":"((SUM(H70:U70)) * Y70)","v":0},null,null,null,null,null,"#ART","#MATKZ",null,null,null,null,null,null,null,null,null,null,"#DIM-213",null,null,null,null,null,null,"#POSMENGE",null,"#PREIS-2390.24",null,"#POSWERT","#BEMERKUNG"]
[null,"N:28.1|28",318113,null,"SGL 210 Race Plate",2390.2399999999998,2939.9951999999998,null,null,null,null,null,null,null,null,null,null,null,null,null,null,0,4200,2390.2399999999998,2939.9951999999998,0,null,null,null,null,null,"#ART","#MATKZ",null,null,null,null,null,null,null,null,null,"#DIM-210",null,null,null,null,null,null,null,"#POSMENGE",null,"#PREIS-2390.24",null,"#POSWERT","#BEMERKUNG"]
[null,"N:28.1|28",318043,null,"SGL 207 Race Plate W",2390.2399999999998,2939.9951999999998,null,null,null,null,null,null,null,null,null,null,null,null,null,null,0,4200,2390.2399999999998,2939.9951999999998,0,null,null,null,null,null,"#ART","#MATKZ",null,null,null,null,null,null,null,null,"#DIM-207",null,null,null,null,null,null,null,null,"#POSMENGE",null,"#PREIS-2390.24",null,"#POSWERT","#BEMERKUNG"]
[null,"N:28.1|28",318053,null,"SGM 207 Race Plate M",2390.2399999999998,2939.9951999999998,null,null,null,null,null,null,null,null,null,null,null,null,null,null,0,4200,2390.2399999999998,2939.9951999999998,0,null,null,null,null,null,"#ART","#MATKZ",null,null,null,null,null,null,null,null,"#DIM-207",null,null,null,null,null,null,null,null,"#POSMENGE",null,"#PREIS-2390.24",null,"#POSWERT","#BEMERKUNG"]
[null,"N:28.1|28",318063,null,"SGL 202 Race Plate",2390.2399999999998,2939.9951999999998,null,null,null,null,null,null,null,null,null,null,null,null,null,null,0,4200,2390.2399999999998,2939.9951999999998,0,null,null,null,null,null,"#ART","#MATKZ",null,null,null,null,null,null,null,"#DIM-202",null,null,null,null,null,null,null,null,null,"#POSMENGE",null,"#PREIS-2390.24",null,"#POSWERT","#BEMERKUNG"]
[null,"N:28.1|28",318073,null,"SG 200 RP WCR 14",2390.2399999999998,2939.9951999999998,null,null,null,null,null,null,null,null,null,null,null,null,null,null,0,4200,2390.2399999999998,2939.9951999999998,0,null,null,null,null,null,"#ART","#MATKZ",null,null,null,null,null,null,"#DIM-200",null,null,null,null,null,null,null,null,null,null,"#POSMENGE",null,"#PREIS-2390.24",null,"#POSWERT","#BEMERKUNG"]
[null,"N:28.1|28",318083,null,"SG 195 RP WCR 14",2390.2399999999998,2939.9951999999998,null,null,null,null,null,null,null,null,null,null,null,null,null,null,0,4200,2390.2399999999998,2939.9951999999998,0,null,null,null,null,null,"#ART","#MATKZ",null,null,null,null,null,"#DIM-195",null,null,null,null,null,null,null,null,null,null,null,"#POSMENGE",null,"#PREIS-2390.24",null,"#POSWERT","#BEMERKUNG"]
[null,"N:28.1|28",318093,null,"SG 185 RP WCR 14",2390.2399999999998,2939.9951999999998,null,null,null,null,null,null,null,null,null,null,null,null,null,null,0,4200,2390.2399999999998,2939.9951999999998,0,null,null,null,null,null,"#ART","#MATKZ",null,null,null,null,"#DIM-185",null,null,null,null,null,null,null,null,null,null,null,null,"#POSMENGE",null,"#PREIS-2390.24",null,"#POSWERT","#BEMERKUNG"]
[null,"N:28.1|28",318103,null,"SG 175 RP WCR 14",2390.2399999999998,2939.9951999999998,null,null,null,null,null,null,null,null,null,null,null,null,null,null,0,4200,2390.2399999999998,2939.9951999999998,0,null,null,null,null,null,"#ART","#MATKZ",null,null,null,"#DIM-175",null,null,null,null,null,null,null,null,null,null,null,null,null,"#POSMENGE",null,"#PREIS-2390.24",null,"#POSWERT","#BEMERKUNG"]

{"sheet":"BUTY","index":2,"n_rows":53,"n_cols":90,"rows_kept":53,"cut":false,"hidden":false,"merged":[[3,6,3,7],[3,8,3,14],[3,15,3,18],[3,19,3,22],[5,6,5,7],[5,8,5,14],[5,15,5,18],[5,19,5,22],[2,3,2,5],[2,6,2,7],[2,8,2,14],[2,15,2,18],[2,19,2,22],[3,3,3,5],[6,3,6,5],[6,8,6,14],[6,15,6,18],[6,19,6,22],[9,5,9,17],[4,3,5,5],[4,6,4,7],[4,8,4,14],[4,15,4,18],[4,19,4,22]]}
["#PRD","#INPUT","http://www.head.com/",null,{"$f":"BUTY!D1","v":0},null,null,"#DD1","#DD1","#DD1","#DD1","#DD1","#DD1","#DD1","#DD1","#DD1","#DD1","#DD1","#DD1","#DD1","#DD1","#DD1","#DD1","#DD1","#DD1","#DD1","#DD1","#DD1","#DD1","#DD1","#DD1","#DD1","#DD1","#DD1","#DD1","#DD1","#DD1","#DD1",null,null,null,null,null,null,null,null,"#FIRST-ADDINFO-COL"]
[{"$f":"SUM(A10:A10)","v":0},{"$f":"SUM(B10:B10)","v":0},"   ",null,"   "]
["B3 has to be empty!!!",null,"Nr klienta",{"$f":"IF(F_CUST_NO=\"\",\"\",F_CUST_NO)","v":"NEW"},null,null,"Nr zamówienia",null,{"$f":"IF(F_ORDER_NO=\"\",\"\",F_ORDER_NO)","v":"PRE RACE 24/25"},null,null,null,null,null,null,"Data zamówienia",null,null,null,{"$f":"IF(F_ORDER_DATE<> \"\",F_ORDER_DATE,\"\")","v":""}]
["Empty Lines:",true,"Nazwa firmy",{"$f":"IF(F_CUST_NAME=\"\",\"\",F_CUST_NAME)","v":""},null,null,"Sales Rep.",null,{"$f":"IF(F_SALES_REP=\"\",\"\",F_SALES_REP)","v":"2694000|Sales Rep / Poland"},null,null,null,null,null,null,"Data dostawy",null,null,null,{"$f":"IF(F_DELDATE1<> \"\",F_DELDATE1,\"\")","v":""}]
["Delivery Date Total:",true,"Adres",{"$f":"IF(F_CUST_ADDR=\"\",\"\",F_CUST_ADDR)","v":""},null,null,null,null,null,null,null,null,null,null,null,null,null,null,null,{"$f":"IF(F_DELDATE2<> \"\",F_DELDATE2,\"\")","v":""}]
["Delivery Date 1:",true,"   ",null,null,null,"Zniżka",null,null,null,null,null,null,null,null,null,null,null,null,{"$f":"IF(F_DELDATE3<> \"\",F_DELDATE3,\"\")","v":""}]
["Delivery Date 2:",true]
["Delivery Date 3:",true]
[null,null,"HEAD Sport GmbH - Wuhrkopfweg 1 "]
[{"$f":"SUM($AM$19:$AM$22)+SUM($AM$25:$AM$29)+SUM($AM$32:$AM$48)+SUM($AM$50:$AM$53)","v":0},{"$f":"SUM($AQ$19:$AQ$22)+SUM($AQ$25:$AQ$29)+SUM($AQ$32:$AQ$48)+SUM($AQ$50:$AQ$53)","v":0},"Wuhrkopfweg 1 - A 6921 Kennelbach Austria",null,null,"BUTY -kod prod. to link do zdjęcia!"]
["Reserved DD2-QTTY","DD2-Amount","FN 64824 f"]
["Reserved DD3-QTTY","DD3-Amount"]
["Reserved DD4-QTTY","DD4-Amount"]
["Reserved DD5-QTTY","DD5-Amount"]
["Reserved DD6-QTTY","DD6-Amount"]
[]
["GH","N:33|","Head Top"]
["H","N:33.1|33","Kod Art.",null,"Model","Cena Racing Netto","Cena Racing Brutto","225","235","245","255","265","275","285","","","","","","","","","","","","","","","","","","","","","","","","","Ilość","Rekomend. Cena Detaliczna","NET-Price","Price incl. VAT","Wartość","Uwagi"]
[null,"N:33.1|33",603051,null,"RAPTOR RD M5",2105.69,{"$f":"F19 * 1.23","v":2589.9987000000001},null,null,null,null,null,null,null,null,null,null,null,null,null,null,null,null,null,null,null,null,null,null,null,null,null,null,null,null,null,null,null,{"$f":"(SUM(H19:AL19))","v":0},3700,{"$f":"AP19 / 1.23","v":2105.69},{"$f":"G19 * (1-WS_DISCOUNT)","v":2589.9987000000001},{"$f":"((SUM(H19:AL19)) * AP19)","v":0},null,null,null,null,null,"#ART","#MATKZ",null,null,null,"#DIM-225","#DIM-235","#DIM-245","#DIM-255","#DIM-265","#DIM-275","#DIM-285",null,null,null,null,null,null,null,null,null,null,null,null,null,null,null,null,null,null,null,null,null,null,null,null,"#POSMENGE",null,"#PREIS-2105.69",null,"#POSWERT","#BEMERKUNG"]
[null,"N:33.1|33",603013,null,"RAPTOR WCR 2 WHITE",2105.69,{"$f":"F20 * 1.23","v":2589.9987000000001},null,null,null,null,null,null,null,null,null,null,null,null,null,null,null,null,null,null,null,null,null,null,null,null,null,null,null,null,null,null,null,{"$f":"(SUM(H20:AL20))","v":0},3700,{"$f":"AP20 / 1.23","v":2105.69},{"$f":"G20 * (1-WS_DISCOUNT)","v":2589.9987000000001},{"$f":"((SUM(H20:AL20)) * AP20)","v":0},null,null,null,null,null,"#ART","#MATKZ",null,null,null,"#DIM-225","#DIM-235","#DIM-245","#DIM-255","#DIM-265","#DIM-275","#DIM-285",null,null,null,null,null,null,null,null,null,null,null,null,null,null,null,null,null,null,null,null,null,null,null,null,"#POSMENGE",null,"#PREIS-2105.69",null,"#POSWERT","#BEMERKUNG"]
[null,"N:33.1|33",603016,null,"RAPTOR WCR 3 WHITE",2105.69,{"$f":"F21 * 1.23","v":2589.9987000000001},null,null,null,null,null,null,null,null,null,null,null,null,null,null,null,null,null,null,null,null,null,null,null,null,null,null,null,null,null,null,null,{"$f":"(SUM(H21:AL21))","v":0},3700,{"$f":"AP21 / 1.23","v":2105.69},{"$f":"G21 * (1-WS_DISCOUNT)","v":2589.9987000000001},{"$f":"((SUM(H21:AL21)) * AP21)","v":0},null,null,null,null,null,"#ART","#MATKZ",null,null,null,"#DIM-225","#DIM-235","#DIM-245","#DIM-255","#DIM-265","#DIM-275","#DIM-285",null,null,null,null,null,null,null,null,null,null,null,null,null,null,null,null,null,null,null,null,null,null,null,null,"#POSMENGE",null,"#PREIS-2105.69",null,"#POSWERT","#BEMERKUNG"]
[null,"N:33.1|33",603019,null,"RAPTOR WCR 4 WHITE",1991.87,{"$f":"F22 * 1.23","v":2450.0000999999997},null,null,null,null,null,null,null,null,null,null,null,null,null,null,null,null,null,null,null,null,null,null,null,null,null,null,null,null,null,null,null,{"$f":"(SUM(H22:AL22))","v":0},3500,{"$f":"AP22 / 1.23","v":1991.87},{"$f":"G22 * (1-WS_DISCOUNT)","v":2450.0000999999997},{"$f":"((SUM(H22:AL22)) * AP22)","v":0},null,null,null,null,null,"#ART","#MATKZ",null,null,null,"#DIM-225","#DIM-235","#DIM-245","#DIM-255","#DIM-265","#DIM-275","#DIM-285",null,null,null,null,null,null,null,null,null,null,null,null,null,null,null,null,null,null,null,null,null,null,null,null,"#POSMENGE",null,"#PREIS-1991.87",null,"#POSWERT","#BEMERKUNG"]
["GH","N:34|","Junior"]
["H","N:34.1|34","Kod Art.",null,"Model","Cena Racing Netto","Cena Racing Brutto","205","215","225","235","245","255","265","275","285","","","","","","","","","","","","","","","","","","","","","","","Ilość","Rekomend. Cena Detaliczna","NET-Price","Price incl. VAT","Wartość","Uwagi"]
[null,"N:34.1|34",603020,null,"RAPTOR WCR 5 SC WHITE",1536.59,{"$f":"F25 * 1.23","v":1890.0056999999999},null,null,null,null,null,null,null,null,null,null,null,null,null,null,null,null,null,null,null,null,null,null,null,null,null,null,null,null,null,null,null,{"$f":"(SUM(H25:AL25))","v":0},2700,{"$f":"AP25 / 1.23","v":1536.59},{"$f":"G25 * (1-WS_DISCOUNT)","v":1890.0056999999999},{"$f":"((SUM(H25:AL25)) * AP25)","v":0},null,null,null,null,null,"#ART","#MATKZ",null,null,null,null,null,"#DIM-225","#DIM-235","#DIM-245","#DIM-255","#DIM-265","#DIM-275",null,null,null,null,null,null,null,null,null,null,null,null,null,null,null,null,null,null,null,null,null,null,null,"#POSMENGE",null,"#PREIS-1536.59",null,"#POSWERT","#BEMERKUNG"]
[null,"N:34.1|34",603022,null,"RAPTOR WCR 6 SC WHITE",1365.85,{"$f":"F26 * 1.23","v":1679.9954999999998},null,null,null,null,null,null,null,null,null,null,null,null,null,null,null,null,null,null,null,null,null,null,null,null,null,null,null,null,null,null,null,{"$f":"(SUM(H26:AL26))","v":0},2400,{"$f":"AP26 / 1.23","v":1365.85},{"$f":"G26 * (1-WS_DISCOUNT)","v":1679.9954999999998},{"$f":"((SUM(H26:AL26)) * AP26)","v":0},null,null,null,null,null,"#ART","#MATKZ",null,null,null,null,null,"#DIM-225","#DIM-235","#DIM-245","#DIM-255","#DIM-265","#DIM-275",null,null,null,null,null,null,null,null,null,null,null,null,null,null,null,null,null,null,null,null,null,null,null,"#POSMENGE",null,"#PREIS-1365.85",null,"#POSWERT","#BEMERKUNG"]
[null,"N:34.1|34",603510,null,"RAPTOR WCR 90 WHITE",995.93,{"$f":"F27 * 1.23","v":1224.9938999999999},null,null,null,null,null,null,null,null,null,null,null,null,null,null,null,null,null,null,null,null,null,null,null,null,null,null,null,null,null,null,null,{"$f":"(SUM(H27:AL27))","v":0},1750,{"$f":"AP27 / 1.23","v":995.93},{"$f":"G27 * (1-WS_DISCOUNT)","v":1224.9938999999999},{"$f":"((SUM(H27:AL27)) * AP27)","v":0},null,null,null,null,null,"#ART","#MATKZ",null,null,null,null,null,"#DIM-225","#DIM-235","#DIM-245","#DIM-255","#DIM-265","#DIM-275","#DIM-285",null,null,null,null,null,null,null,null,null,null,null,null,null,null,null,null,null,null,null,null,null,null,"#POSMENGE",null,"#PREIS-995.93",null,"#POSWERT","#BEMERKUNG"]
[null,"N:34.1|34",603515,null,"RAPTOR WCR 70 WHITE",882.11,{"$f":"F28 * 1.23","v":1084.9953},null,null,null,null,null,null,null,null,null,null,null,null,null,null,null,null,null,null,null,null,null,null,null,null,null,null,null,null,null,null,null,{"$f":"(SUM(H28:AL28))","v":0},1550,{"$f":"AP28 / 1.23","v":882.11},{"$f":"G28 * (1-WS_DISCOUNT)","v":1084.9953},{"$f":"((SUM(H28:AL28)) * AP28)","v":0},null,null,null,null,null,"#ART","#MATKZ",null,null,null,null,null,"#DIM-225","#DIM-235","#DIM-245","#DIM-255","#DIM-265","#DIM-275","#DIM-285",null,null,null,null,null,null,null,null,null,null,null,null,null,null,null,null,null,null,null,null,null,null,"#POSMENGE",null,"#PREIS-882.11",null,"#POSWERT","#BEMERKUNG"]
[null,"N:34.1|34",603520,null,"RAPTOR 70 WHITE",626.02,{"$f":"F29 * 1.23","v":770.00459999999998},null,null,null,null,null,null,null,null,null,null,null,null,null,null,null,null,null,null,null,null,null,null,null,null,null,null,null,null,null,null,null,{"$f":"(SUM(H29:AL29))","v":0},1100,{"$f":"AP29 / 1.23","v":626.02},{"$f":"G29 * (1-WS_DISCOUNT)","v":770.00459999999998},{"$f":"((SUM(H29:AL29)) * AP29)","v":0},null,null,null,null,null,"#ART","#MATKZ",null,null,null,"#DIM-205","#DIM-215","#DIM-225","#DIM-235","#DIM-245","#DIM-255","#DIM-265","#DIM-275",null,null,null,null,null,null,null,null,null,null,null,null,null,null,null,null,null,null,null,null,null,null,null,"#POSMENGE",null,"#PREIS-626.02",null,"#POSWERT","#BEMERKUNG"]
["GH","N:43|","Części"]
["H","N:43.1|43","Kod Art.",null,"Model","Cena Racing Netto","Cena Racing Brutto","QTY","S2023","771860","771868","725760","725768","8007650","771301","771302","771303","7937225","7937235","7937245","7937255","7937265","7937275","7937285","0097220","0097240","0097260","0097280","6757220","6757240","6757260","6757280","1156","0097","115601","115602","220","270","Ilość","Rekomend. Cena Detaliczna","NET-Price","Price incl. VAT","Wartość","Uwagi"]
[null,"N:43.1|43",60123136,null,"POWER STRAP RAPTOR WCR 53MM",108.13,{"$f":"F32 * 1.23","v":132.9999},null,null,null,null,null,null,null,null,null,null,null,null,null,null,null,null,null,null,null,null,null,null,null,null,null,null,null,null,null,null,null,{"$f":"(SUM(H32:AL32))","v":0},190,{"$f":"AP32 / 1.23","v":108.13},{"$f":"G32 * (1-WS_DISCOUNT)","v":132.9999},{"$f":"((SUM(H32:AL32)) * AP32)","v":0},null,null,null,null,null,"#ART","#MATKZ",null,null,null,null,null,"#DIM-771860","#DIM-771868",null,null,null,null,null,null,null,null,null,null,null,null,null,null,null,null,null,null,null,null,null,null,null,null,null,null,null,"#POSMENGE",null,"#PREIS-108.13",null,"#POSWERT","#BEMERKUNG"]
[null,"N:43.1|43",60121788,null,"POWER STRAP RAPTOR WCR 39MM",79.67,97.994100000000003,null,null,null,null,null,null,null,null,null,null,null,null,null,null,null,null,null,null,null,null,null,null,null,null,null,null,null,null,null,null,null,0,140,79.67,97.994100000000003,0,null,null,null,null,null,"#ART","#MATKZ",null,null,null,null,null,null,null,"#DIM-725760","#DIM-725768",null,null,null,null,null,null,null,null,null,null,null,null,null,null,null,null,null,null,null,null,null,null,null,null,null,"#POSMENGE",null,"#PREIS-79.67",null,"#POSWERT","#BEMERKUNG"]
[null,"N:43.1|43",60123629,null,"POWER STRAP SIDAS SOFT P3 40MM 2024",256.10000000000002,315.00300000000004,null,null,null,null,null,null,null,null,null,null,null,null,null,null,null,null,null,null,null,null,null,null,null,null,null,null,null,null,null,null,null,0,450,256.10000000000002,315.00300000000004,0,null,null,null,null,null,"#ART","#MATKZ",null,null,null,null,null,null,null,null,null,"#DIM-8007650",null,null,null,null,null,null,null,null,null,null,null,null,null,null,null,null,null,null,null,null,null,null,null,null,"#POSMENGE",null,"#PREIS-256.1",null,"#POSWERT","#BEMERKUNG"]
[null,"N:43.1|43",60123699,null,"POWER STRAP SIDAS HARD P4 40MM 2024",256.10000000000002,315.00300000000004,null,null,null,null,null,null,null,null,null,null,null,null,null,null,null,null,null,null,null,null,null,null,null,null,null,null,null,null,null,null,null,0,450,256.10000000000002,315.00300000000004,0,null,null,null,null,null,"#ART","#MATKZ",null,null,null,null,null,null,null,null,null,"#DIM-8007650",null,null,null,null,null,null,null,null,null,null,null,null,null,null,null,null,null,null,null,null,null,null,null,null,"#POSMENGE",null,"#PREIS-256.1",null,"#POSWERT","#BEMERKUNG"]
[null,"N:43.1|43",60123520,null,"RACE TONGUE SL",73.98,90.995400000000004,null,null,null,null,null,null,null,null,null,null,null,null,null,null,null,null,null,null,null,null,null,null,null,null,null,null,null,null,null,null,null,0,130,73.98,90.995400000000004,0,null,null,null,null,null,"#ART","#MATKZ",null,null,null,null,null,null,null,null,null,null,"#DIM-771301","#DIM-771302","#DIM-771303",null,null,null,null,null,null,null,null,null,null,null,null,null,null,null,null,null,null,null,null,null,"#POSMENGE",null,"#PREIS-73.98",null,"#POSWERT","#BEMERKUNG"]
[null,"N:43.1|43",60118598,null,"INNERBOOT FOAM PRO",626.02,770.00459999999998,null,null,null,null,null,null,null,null,null,null,null,null,null,null,null,null,null,null,null,null,null,null,null,null,null,null,null,null,null,null,null,0,1100,626.02,770.00459999999998,0,null,null,null,null,null,"#ART","#MATKZ",null,null,null,null,null,null,null,null,null,null,null,null,null,"#DIM-7937225","#DIM-7937235","#DIM-7937245","#DIM-7937255","#DIM-7937265","#DIM-7937275","#DIM-7937285",null,null,null,null,null,null,null,null,null,null,null,null,null,null,"#POSMENGE",null,"#PREIS-626.02",null,"#POSWERT","#BEMERKUNG"]
[null,"N:43.1|43",60118782,null,"TONGUE FOAM PRO - 2015",256.10000000000002,315.00300000000004,null,null,null,null,null,null,null,null,null,null,null,null,null,null,null,null,null,null,null,null,null,null,null,null,null,null,null,null,null,null,null,0,450,256.10000000000002,315.00300000000004,0,null,null,null,null,null,"#ART","#MATKZ",null,null,null,null,null,null,null,null,null,null,null,null,null,null,null,null,null,null,null,null,"#DIM-0097220","#DIM-0097240","#DIM-0097260","#DIM-0097280",null,null,null,null,null,null,null,null,null,null,"#POSMENGE",null,"#PREIS-256.1",null,"#POSWERT","#BEMERKUNG"]
[null,"N:43.1|43",60123540,null,"TUNING KIT RACING 2023",1422.76,1749.9947999999999,null,null,null,null,null,null,null,null,null,null,null,null,null,null,null,null,null,null,null,null,null,null,null,null,null,null,null,null,null,null,null,0,2500,1422.76,1749.9947999999999,0,null,null,null,null,null,"#ART","#MATKZ",null,null,null,null,"#DIM-S2023",null,null,null,null,null,null,null,null,null,null,null,null,null,null,null,null,null,null,null,null,null,null,null,null,null,null,null,null,null,"#POSMENGE",null,"#PREIS-1422.76",null,"#POSWERT","#BEMERKUNG"]
[null,"N:43.1|43",60122049,null,"RACING CARBON SPOILER KIT REG.2020",227.64,279.99719999999996,null,null,null,null,null,null,null,null,null,null,null,null,null,null,null,null,null,null,null,null,null,null,null,null,null,null,null,null,null,null,null,0,400,227.64,279.99719999999996,0,null,null,null,null,null,"#ART","#MATKZ",null,null,null,null,null,null,null,null,null,null,null,null,null,null,null,null,null,null,null,null,null,null,null,null,"#DIM-6757220","#DIM-6757240","#DIM-6757260","#DIM-6757280",null,null,null,null,null,null,"#POSMENGE",null,"#PREIS-227.64",null,"#POSWERT","#BEMERKUNG"]
[null,"N:43.1|43",60123478,null,"KIT REAR CUFF SPOILER RACING DEPT. 6MM",34.15,42.0045,null,null,null,null,null,null,null,null,null,null,null,null,null,null,null,null,null,null,null,null,null,null,null,null,null,null,null,null,null,null,null,0,60,34.15,42.0045,0,null,null,null,null,null,"#ART","#MATKZ",null,null,null,null,null,null,null,null,null,null,null,null,null,null,null,null,null,null,null,null,null,null,null,null,null,null,null,null,"#DIM-1156",null,null,null,null,null,"#POSMENGE",null,"#PREIS-34.15",null,"#POSWERT","#BEMERKUNG"]
[null,"N:43.1|43",60123479,null,"KIT REAR CUFF SPOILER RACING DEPT. 9MM",34.15,42.0045,null,null,null,null,null,null,null,null,null,null,null,null,null,null,null,null,null,null,null,null,null,null,null,null,null,null,null,null,null,null,null,0,60,34.15,42.0045,0,null,null,null,null,null,"#ART","#MATKZ",null,null,null,null,null,null,null,null,null,null,null,null,null,null,null,null,null,null,null,null,null,null,null,null,null,null,null,null,"#DIM-1156",null,null,null,null,null,"#POSMENGE",null,"#PREIS-34.15",null,"#POSWERT","#BEMERKUNG"]
[null,"N:43.1|43",60123755,null,"KIT BRIDGE BUCKLE + TOOTHPLATES RAPTOR",256.10000000000002,315.00300000000004,null,null,null,null,null,null,null,null,null,null,null,null,null,null,null,null,null,null,null,null,null,null,null,null,null,null,null,null,null,null,null,0,450,256.10000000000002,315.00300000000004,0,null,null,null,null,null,"#ART","#MATKZ",null,null,null,null,"#DIM-S2023",null,null,null,null,null,null,null,null,null,null,null,null,null,null,null,null,null,null,null,null,null,null,null,null,null,null,null,null,null,"#POSMENGE",null,"#PREIS-256.1",null,"#POSWERT","#BEMERKUNG"]
[null,"N:43.1|43",60123201,null,"SPOILER RAPTOR RACE (U1) + VELCRO",36.99,45.497700000000002,null,null,null,null,null,null,null,null,null,null,null,null,null,null,null,null,null,null,null,null,null,null,null,null,null,null,null,null,null,null,null,0,65,36.99,45.497700000000002,0,null,null,null,null,null,"#ART","#MATKZ",null,null,null,null,null,null,null,null,null,null,null,null,null,null,null,null,null,null,null,null,null,null,null,null,null,null,null,null,null,"#DIM-0097",null,null,null,null,"#POSMENGE",null,"#PREIS-36.99",null,"#POSWERT","#BEMERKUNG"]
[null,"N:43.1|43",60113662,null,"DISPENSER FOAM RAPTOR",313.01,385.00229999999999,null,null,null,null,null,null,null,null,null,null,null,null,null,null,null,null,null,null,null,null,null,null,null,null,null,null,null,null,null,null,null,0,550,313.01,385.00229999999999,0,null,null,null,null,null,"#ART","#MATKZ",null,null,null,"#DIM-QTY",null,null,null,null,null,null,null,null,null,null,null,null,null,null,null,null,null,null,null,null,null,null,null,null,null,null,null,null,null,null,"#POSMENGE",null,"#PREIS-313.01",null,"#POSWERT","#BEMERKUNG"]
[null,"N:43.1|43",60113212,null,"FOAM KIT HEAD 154/85-25/12(220-250)",142.28,175.0044,null,null,null,null,null,null,null,null,null,null,null,null,null,null,null,null,null,null,null,null,null,null,null,null,null,null,null,null,null,null,null,0,250,142.28,175.0044,0,null,null,null,null,null,"#ART","#MATKZ",null,null,null,null,null,null,null,null,null,null,null,null,null,null,null,null,null,null,null,null,null,null,null,null,null,null,null,null,null,null,null,null,"#DIM-220",null,"#POSMENGE",null,"#PREIS-142.28",null,"#POSWERT","#BEMERKUNG"]
[null,"N:43.1|43",60113213,null,"FOAM KIT HEAD 165/91-29/14(260-270)",142.28,175.0044,null,null,null,null,null,null,null,null,null,null,null,null,null,null,null,null,null,null,null,null,null,null,null,null,null,null,null,null,null,null,null,0,250,142.28,175.0044,0,null,null,null,null,null,"#ART","#MATKZ",null,null,null,null,null,null,null,null,null,null,null,null,null,null,null,null,null,null,null,null,null,null,null,null,null,null,null,null,null,null,null,null,null,"#DIM-270","#POSMENGE",null,"#PREIS-142.28",null,"#POSWERT","#BEMERKUNG"]
[null,"N:43.1|43",60116390,null,"FOAM KIT HEAD 175/95-31/16 (280-300)",142.28,175.0044,null,null,null,null,null,null,null,null,null,null,null,null,null,null,null,null,null,null,null,null,null,null,null,null,null,null,null,null,null,null,null,0,250,142.28,175.0044,0,null,null,null,null,null,"#ART","#MATKZ",null,null,null,"#DIM-QTY",null,null,null,null,null,null,null,null,null,null,null,null,null,null,null,null,null,null,null,null,null,null,null,null,null,null,null,null,null,null,"#POSMENGE",null,"#PREIS-142.28",null,"#POSWERT","#BEMERKUNG"]
["T","N:43.1|43",null,null,"Liftery"]
[null,"N:43.1|43",60121988,null,"1 PR.HEEL/TOE LIFTER KIT RAPTOR WCR MM.3",36.99,{"$f":"F50 * 1.23","v":45.497700000000002},null,null,null,null,null,null,null,null,null,null,null,null,null,null,null,null,null,null,null,null,null,null,null,null,null,null,null,null,null,null,null,{"$f":"(SUM(H50:AL50))","v":0},65,{"$f":"AP50 / 1.23","v":36.99},{"$f":"G50 * (1-WS_DISCOUNT)","v":45.497700000000002},{"$f":"((SUM(H50:AL50)) * AP50)","v":0},null,null,null,null,null,"#ART","#MATKZ",null,null,null,null,null,null,null,null,null,null,null,null,null,null,null,null,null,null,null,null,null,null,null,null,null,null,null,null,null,null,"#DIM-115601","#DIM-115602",null,null,"#POSMENGE",null,"#PREIS-36.99",null,"#POSWERT","#BEMERKUNG"]
[null,"N:43.1|43",60121989,null,"1 PR.HEEL/TOE LIFTER KIT RAPTOR WCR MM.5",42.68,{"$f":"F51 * 1.23","v":52.496400000000001},null,null,null,null,null,null,null,null,null,null,null,null,null,null,null,null,null,null,null,null,null,null,null,null,null,null,null,null,null,null,null,{"$f":"(SUM(H51:AL51))","v":0},75,{"$f":"AP51 / 1.23","v":42.68},{"$f":"G51 * (1-WS_DISCOUNT)","v":52.496400000000001},{"$f":"((SUM(H51:AL51)) * AP51)","v":0},null,null,null,null,null,"#ART","#MATKZ",null,null,null,null,null,null,null,null,null,null,null,null,null,null,null,null,null,null,null,null,null,null,null,null,null,null,null,null,null,null,"#DIM-115601","#DIM-115602",null,null,"#POSMENGE",null,"#PREIS-42.68",null,"#POSWERT","#BEMERKUNG"]
[null,"N:43.1|43",60123495,null,"1 PR.HEEL/TOE LIFTER KIT WCR MM.5 GRIP",42.68,{"$f":"F52 * 1.23","v":52.496400000000001},null,null,null,null,null,null,null,null,null,null,null,null,null,null,null,null,null,null,null,null,null,null,null,null,null,null,null,null,null,null,null,{"$f":"(SUM(H52:AL52))","v":0},75,{"$f":"AP52 / 1.23","v":42.68},{"$f":"G52 * (1-WS_DISCOUNT)","v":52.496400000000001},{"$f":"((SUM(H52:AL52)) * AP52)","v":0},null,null,null,null,null,"#ART","#MATKZ",null,null,null,null,null,null,null,null,null,null,null,null,null,null,null,null,null,null,null,null,null,null,null,null,null,null,null,null,null,null,null,"#DIM-115602",null,null,"#POSMENGE",null,"#PREIS-42.68",null,"#POSWERT","#BEMERKUNG"]
[null,"N:43.1|43",60121990,null,"1 PR.HEEL/TOE LIFTER KIT RAPTOR WCR MM.7",48.37,{"$f":"F53 * 1.23","v":59.495099999999994},null,null,null,null,null,null,null,null,null,null,null,null,null,null,null,null,null,null,null,null,null,null,null,null,null,null,null,null,null,null,null,{"$f":"(SUM(H53:AL53))","v":0},85,{"$f":"AP53 / 1.23","v":48.37},{"$f":"G53 * (1-WS_DISCOUNT)","v":59.495099999999994},{"$f":"((SUM(H53:AL53)) * AP53)","v":0},null,null,null,null,null,"#ART","#MATKZ",null,null,null,null,null,null,null,null,null,null,null,null,null,null,null,null,null,null,null,null,null,null,null,null,null,null,null,null,null,null,"#DIM-115601","#DIM-115602",null,null,"#POSMENGE",null,"#PREIS-48.37",null,"#POSWERT","#BEMERKUNG"]

{"sheet":"KASKI","index":3,"n_rows":27,"n_cols":51,"rows_kept":27,"cut":false,"hidden":false,"merged":[[3,6,3,7],[3,8,3,14],[3,15,3,18],[3,19,3,22],[5,6,5,7],[5,8,5,14],[5,15,5,18],[5,19,5,22],[2,3,2,5],[2,6,2,7],[2,8,2,14],[2,15,2,18],[2,19,2,22],[3,3,3,5],[6,3,6,5],[6,8,6,14],[6,15,6,18],[6,19,6,22],[9,5,9,17],[4,3,5,5],[4,6,4,7],[4,8,4,14],[4,15,4,18],[4,19,4,22]]}
["#PRD","#INPUT","http://www.head.com/",null,{"$f":"KASKI!D1","v":0},null,null,"#DD1","#DD1","#DD1","#DD1","#DD1","#DD1","#DD1","#DD1","#DD1",null,null,null,null,null,null,null,null,null,null,null,null,null,"#FIRST-ADDINFO-COL"]
[{"$f":"SUM(A10:A10)","v":0},{"$f":"SUM(B10:B10)","v":0},"   ",null,"   "]
["B3 has to be empty!!!",null,"Nr klienta",{"$f":"IF(F_CUST_NO=\"\",\"\",F_CUST_NO)","v":"NEW"},null,null,"Nr zamówienia",null,{"$f":"IF(F_ORDER_NO=\"\",\"\",F_ORDER_NO)","v":"PRE RACE 24/25"},null,null,null,null,null,null,"Data zamówienia",null,null,null,{"$f":"IF(F_ORDER_DATE<> \"\",F_ORDER_DATE,\"\")","v":""}]
["Empty Lines:",true,"Nazwa firmy",{"$f":"IF(F_CUST_NAME=\"\",\"\",F_CUST_NAME)","v":""},null,null,"Sales Rep.",null,{"$f":"IF(F_SALES_REP=\"\",\"\",F_SALES_REP)","v":"2694000|Sales Rep / Poland"},null,null,null,null,null,null,"Data dostawy",null,null,null,{"$f":"IF(F_DELDATE1<> \"\",F_DELDATE1,\"\")","v":""}]
["Delivery Date Total:",true,"Adres",{"$f":"IF(F_CUST_ADDR=\"\",\"\",F_CUST_ADDR)","v":""},null,null,null,null,null,null,null,null,null,null,null,null,null,null,null,{"$f":"IF(F_DELDATE2<> \"\",F_DELDATE2,\"\")","v":""}]
["Delivery Date 1:",true,"   ",null,null,null,"Zniżka",null,null,null,null,null,null,null,null,null,null,null,null,{"$f":"IF(F_DELDATE3<> \"\",F_DELDATE3,\"\")","v":""}]
["Delivery Date 2:",true]
["Delivery Date 3:",true]
[null,null,"HEAD Sport GmbH - Wuhrkopfweg 1 "]
[{"$f":"SUM($Q$19:$Q$23)+SUM($Q$26:$Q$27)","v":0},{"$f":"SUM($U$19:$U$23)+SUM($U$26:$U$27)","v":0},"Wuhrkopfweg 1 - A 6921 Kennelbach Austria",null,null,"KASKI -kod prod. to link do zdjęcia!"]
["Reserved DD2-QTTY","DD2-Amount","FN 64824 f"]
["Reserved DD3-QTTY","DD3-Amount"]
["Reserved DD4-QTTY","DD4-Amount"]
["Reserved DD5-QTTY","DD5-Amount"]
["Reserved DD6-QTTY","DD6-Amount"]
[]
["GH","N:35|","Racing"]
["H","N:35.1|35","Kod Art.",null,"Model","Cena Racing Netto","Cena Racing Brutto","XS","S","M","L","XL","XXL","XS/S","M/L","XL/XXL","Ilość","Rekomend. Cena Detaliczna","NET-Price","Price incl. VAT","Wartość","Uwagi"]
[null,"N:35.1|35",320113,null,"DOWNFORCE MIPS matt black",739.84,{"$f":"F19 * 1.23","v":910.00319999999999},null,null,null,null,null,null,null,null,null,{"$f":"(SUM(H19:P19))","v":0},1300,{"$f":"T19 / 1.23","v":739.84},{"$f":"G19 * (1-WS_DISCOUNT)","v":910.00319999999999},{"$f":"((SUM(H19:P19)) * T19)","v":0},null,null,null,null,null,null,null,null,null,null,"#ART","#MATKZ",null,null,null,"#DIM-XS","#DIM-S","#DIM-M","#DIM-L","#DIM-XL","#DIM-XXL",null,null,null,"#POSMENGE",null,"#PREIS-739.84",null,"#POSWERT","#BEMERKUNG"]
[null,"N:35.1|35",320224,null,"DOWNFORCE speedblue/white",512.20000000000005,{"$f":"F20 * 1.23","v":630.00600000000009},null,null,null,null,null,null,null,null,null,{"$f":"(SUM(H20:P20))","v":0},900,{"$f":"T20 / 1.23","v":512.20000000000005},{"$f":"G20 * (1-WS_DISCOUNT)","v":630.00600000000009},{"$f":"((SUM(H20:P20)) * T20)","v":0},null,null,null,null,null,null,null,null,null,null,"#ART","#MATKZ",null,null,null,"#DIM-XS","#DIM-S","#DIM-M","#DIM-L","#DIM-XL","#DIM-XXL",null,null,null,"#POSMENGE",null,"#PREIS-512.2",null,"#POSWERT","#BEMERKUNG"]
[null,"N:35.1|35",320223,null,"DOWNFORCE white",512.20000000000005,{"$f":"F21 * 1.23","v":630.00600000000009},null,null,null,null,null,null,null,null,null,{"$f":"(SUM(H21:P21))","v":0},900,{"$f":"T21 / 1.23","v":512.20000000000005},{"$f":"G21 * (1-WS_DISCOUNT)","v":630.00600000000009},{"$f":"((SUM(H21:P21)) * T21)","v":0},null,null,null,null,null,null,null,null,null,null,"#ART","#MATKZ",null,null,null,"#DIM-XS","#DIM-S","#DIM-M","#DIM-L","#DIM-XL","#DIM-XXL",null,null,null,"#POSMENGE",null,"#PREIS-512.2",null,"#POSWERT","#BEMERKUNG"]
[null,"N:35.1|35",320323,null,"DOWNFORCE JR speedblue",426.83,{"$f":"F22 * 1.23","v":525.0009},null,null,null,null,null,null,null,null,null,{"$f":"(SUM(H22:P22))","v":0},750,{"$f":"T22 / 1.23","v":426.83},{"$f":"G22 * (1-WS_DISCOUNT)","v":525.0009},{"$f":"((SUM(H22:P22)) * T22)","v":0},null,null,null,null,null,null,null,null,null,null,"#ART","#MATKZ",null,null,null,"#DIM-XS","#DIM-S","#DIM-M",null,null,null,null,null,null,"#POSMENGE",null,"#PREIS-426.83",null,"#POSWERT","#BEMERKUNG"]
[null,"N:35.1|35",320413,null,"TEAM SL white/black",449.59,{"$f":"F23 * 1.23","v":552.99569999999994},null,null,null,null,null,null,null,null,null,{"$f":"(SUM(H23:P23))","v":0},790,{"$f":"T23 / 1.23","v":449.59},{"$f":"G23 * (1-WS_DISCOUNT)","v":552.99569999999994},{"$f":"((SUM(H23:P23)) * T23)","v":0},null,null,null,null,null,null,null,null,null,null,"#ART","#MATKZ",null,null,null,null,null,null,null,null,null,"#DIM-XS/S","#DIM-M/L","#DIM-XL/XXL","#POSMENGE",null,"#PREIS-449.59",null,"#POSWERT","#BEMERKUNG"]
["GH","N:63|","Akcesoria"]
["H","N:63.1|63","Kod Art.",null,"Model","Cena Racing Netto","Cena Racing Brutto","QTY","XS/S","M/L","XL/XXL","","","","","","Ilość","Rekomend. Cena Detaliczna","NET-Price","Price incl. VAT","Wartość","Uwagi"]
[null,"N:63.1|63",378577,null,"Chinguard",102.44,{"$f":"F26 * 1.23","v":126.0012},null,null,null,null,null,null,null,null,null,{"$f":"(SUM(H26:P26))","v":0},180,{"$f":"T26 / 1.23","v":102.44},{"$f":"G26 * (1-WS_DISCOUNT)","v":126.0012},{"$f":"((SUM(H26:P26)) * T26)","v":0},null,null,null,null,null,null,null,null,null,null,"#ART","#MATKZ",null,null,null,"#DIM-QTY",null,null,null,null,null,null,null,null,"#POSMENGE",null,"#PREIS-102.44",null,"#POSWERT","#BEMERKUNG"]
[null,"N:63.1|63",378930,null,"DOWNFORCE FITTING KIT",51.22,{"$f":"F27 * 1.23","v":63.000599999999999},null,null,null,null,null,null,null,null,null,{"$f":"(SUM(H27:P27))","v":0},90,{"$f":"T27 / 1.23","v":51.22},{"$f":"G27 * (1-WS_DISCOUNT)","v":63.000599999999999},{"$f":"((SUM(H27:P27)) * T27)","v":0},null,null,null,null,null,null,null,null,null,null,"#ART","#MATKZ",null,null,null,null,"#DIM-XS/S","#DIM-M/L","#DIM-XL/XXL",null,null,null,null,null,"#POSMENGE",null,"#PREIS-51.22",null,"#POSWERT","#BEMERKUNG"]

{"sheet":"GOGLE","index":4,"n_rows":36,"n_cols":46,"rows_kept":36,"cut":false,"hidden":false,"merged":[[3,6,3,7],[3,8,3,14],[3,15,3,18],[3,19,3,22],[5,6,5,7],[5,8,5,14],[5,15,5,18],[5,19,5,22],[2,3,2,5],[2,6,2,7],[2,8,2,14],[2,15,2,18],[2,19,2,22],[3,3,3,5],[6,3,6,5],[6,8,6,14],[6,15,6,18],[6,19,6,22],[9,5,9,17],[4,3,5,5],[4,6,4,7],[4,8,4,14],[4,15,4,18],[4,19,4,22]]}
["#PRD","#INPUT","http://www.head.com/",null,{"$f":"GOGLE!D1","v":0},null,null,"#DD1","#DD1","#DD1","#DD1",null,null,null,null,null,null,null,null,null,null,null,null,null,null,null,null,null,null,"#FIRST-ADDINFO-COL"]
[{"$f":"SUM(A10:A10)","v":0},{"$f":"SUM(B10:B10)","v":0},"   ",null,"   "]
["B3 has to be empty!!!",null,"Nr klienta",{"$f":"IF(F_CUST_NO=\"\",\"\",F_CUST_NO)","v":"NEW"},null,null,"Nr zamówienia",null,{"$f":"IF(F_ORDER_NO=\"\",\"\",F_ORDER_NO)","v":"PRE RACE 24/25"},null,null,null,null,null,null,"Data zamówienia",null,null,null,{"$f":"IF(F_ORDER_DATE<> \"\",F_ORDER_DATE,\"\")","v":""}]
["Empty Lines:",true,"Nazwa firmy",{"$f":"IF(F_CUST_NAME=\"\",\"\",F_CUST_NAME)","v":""},null,null,"Sales Rep.",null,{"$f":"IF(F_SALES_REP=\"\",\"\",F_SALES_REP)","v":"2694000|Sales Rep / Poland"},null,null,null,null,null,null,"Data dostawy",null,null,null,{"$f":"IF(F_DELDATE1<> \"\",F_DELDATE1,\"\")","v":""}]
["Delivery Date Total:",true,"Adres",{"$f":"IF(F_CUST_ADDR=\"\",\"\",F_CUST_ADDR)","v":""},null,null,null,null,null,null,null,null,null,null,null,null,null,null,null,{"$f":"IF(F_DELDATE2<> \"\",F_DELDATE2,\"\")","v":""}]
["Delivery Date 1:",true,"   ",null,null,null,"Zniżka",null,null,null,null,null,null,null,null,null,null,null,null,{"$f":"IF(F_DELDATE3<> \"\",F_DELDATE3,\"\")","v":""}]
["Delivery Date 2:",true]
["Delivery Date 3:",true]
[null,null,"HEAD Sport GmbH - Wuhrkopfweg 1 "]
[{"$f":"SUM($L$19:$L$25)+SUM($L$28:$L$29)+SUM($L$32:$L$36)","v":0},{"$f":"SUM($P$19:$P$25)+SUM($P$28:$P$29)+SUM($P$32:$P$36)","v":0},"Wuhrkopfweg 1 - A 6921 Kennelbach Austria",null,null,"GOGLE -kod prod. to link do zdjęcia!"]
["Reserved DD2-QTTY","DD2-Amount","FN 64824 f"]
["Reserved DD3-QTTY","DD3-Amount"]
["Reserved DD4-QTTY","DD4-Amount"]
["Reserved DD5-QTTY","DD5-Amount"]
["Reserved DD6-QTTY","DD6-Amount"]
[]
["GH","N:39|","Race"]
["H","N:39.1|39","Kod Art.",null,"Model","Cena Racing Netto","Cena Racing Brutto","QTY","S","M","L","Ilość","Rekomend. Cena Detaliczna","NET-Price","Price incl. VAT","Wartość","Uwagi"]
[null,"N:39.1|39",390023,null,"SENTINEL 5K chrome RD + SL",426.83,{"$f":"F19 * 1.23","v":525.0009},null,null,null,null,{"$f":"(SUM(H19:K19))","v":0},750,{"$f":"O19 / 1.23","v":426.83},{"$f":"G19 * (1-WS_DISCOUNT)","v":525.0009},{"$f":"((SUM(H19:K19)) * O19)","v":0},null,null,null,null,null,null,null,null,null,null,null,null,null,null,null,"#ART","#MATKZ",null,null,null,"#DIM-QTY",null,null,null,"#POSMENGE",null,"#PREIS-426.83",null,"#POSWERT","#BEMERKUNG"]
[null,"N:39.1|39",390053,null,"SENTINEL black + SL",398.37,489.99509999999998,null,null,null,null,0,700,398.37,489.99509999999998,0,null,null,null,null,null,null,null,null,null,null,null,null,null,null,null,"#ART","#MATKZ",null,null,null,"#DIM-QTY",null,null,null,"#POSMENGE",null,"#PREIS-398.37",null,"#POSWERT","#BEMERKUNG"]
[null,"N:39.1|39",390123,null,"HORIZON 5K RACE chrome RD + SL",369.92,455.0016,null,null,null,null,0,650,369.92,455.0016,0,null,null,null,null,null,null,null,null,null,null,null,null,null,null,null,"#ART","#MATKZ",null,null,null,"#DIM-QTY",null,null,null,"#POSMENGE",null,"#PREIS-369.92",null,"#POSWERT","#BEMERKUNG"]
[null,"N:39.1|39",390143,null,"HORIZON RACE black + SL",341.46,419.99579999999997,null,null,null,null,0,600,341.46,419.99579999999997,0,null,null,null,null,null,null,null,null,null,null,null,null,null,null,null,"#ART","#MATKZ",null,null,null,"#DIM-QTY",null,null,null,"#POSMENGE",null,"#PREIS-341.46",null,"#POSWERT","#BEMERKUNG"]
[null,"N:39.1|39",390154,null,"NEVES PRO 5K RACE chrome RD + SL",369.92,455.0016,null,null,null,null,0,650,369.92,455.0016,0,null,null,null,null,null,null,null,null,null,null,null,null,null,null,null,"#ART","#MATKZ",null,null,null,null,null,"#DIM-M","#DIM-L","#POSMENGE",null,"#PREIS-369.92",null,"#POSWERT","#BEMERKUNG"]
[null,"N:39.1|39",390163,null,"CONTEX PRO 5K RACE chrome RD + SL",341.46,419.99579999999997,null,null,null,null,0,600,341.46,419.99579999999997,0,null,null,null,null,null,null,null,null,null,null,null,null,null,null,null,"#ART","#MATKZ",null,null,null,null,"#DIM-S","#DIM-M","#DIM-L","#POSMENGE",null,"#PREIS-341.46",null,"#POSWERT","#BEMERKUNG"]
[null,"N:39.1|39",374420,null,"GOGGLE PRO BAG",170.73,209.99789999999999,null,null,null,null,0,300,170.73,209.99789999999999,0,null,null,null,null,null,null,null,null,null,null,null,null,null,null,null,"#ART","#MATKZ",null,null,null,"#DIM-QTY",null,null,null,"#POSMENGE",null,"#PREIS-170.73",null,"#POSWERT","#BEMERKUNG"]
["GH","N:67|","Strapy"]
["H","N:67.1|67","Kod Art.",null,"Model","Cena Racing Netto","Cena Racing Brutto","QTY","","","","Ilość","Rekomend. Cena Detaliczna","NET-Price","Price incl. VAT","Wartość","Uwagi"]
[null,"N:67.1|67",376942,null,"STRAP silver",56.91,{"$f":"F28 * 1.23","v":69.999299999999991},null,null,null,null,{"$f":"(SUM(H28:K28))","v":0},100,{"$f":"O28 / 1.23","v":56.91},{"$f":"G28 * (1-WS_DISCOUNT)","v":69.999299999999991},{"$f":"((SUM(H28:K28)) * O28)","v":0},null,null,null,null,null,null,null,null,null,null,null,null,null,null,null,"#ART","#MATKZ",null,null,null,"#DIM-QTY",null,null,null,"#POSMENGE",null,"#PREIS-56.91",null,"#POSWERT","#BEMERKUNG"]
[null,"N:67.1|67",376953,null,"STRAP RD",56.91,{"$f":"F29 * 1.23","v":69.999299999999991},null,null,null,null,{"$f":"(SUM(H29:K29))","v":0},100,{"$f":"O29 / 1.23","v":56.91},{"$f":"G29 * (1-WS_DISCOUNT)","v":69.999299999999991},{"$f":"((SUM(H29:K29)) * O29)","v":0},null,null,null,null,null,null,null,null,null,null,null,null,null,null,null,"#ART","#MATKZ",null,null,null,"#DIM-QTY",null,null,null,"#POSMENGE",null,"#PREIS-56.91",null,"#POSWERT","#BEMERKUNG"]
["GH","N:68|","Okulary"]
["H","N:68.1|68","Kod Art.",null,"Model","Cena Racing Netto","Cena Racing Brutto","QTY","","","","Ilość","Rekomend. Cena Detaliczna","NET-Price","Price incl. VAT","Wartość","Uwagi"]
[null,"N:68.1|68",370003,null,"SIGNATURE 5K PHOTO",313.01,{"$f":"F32 * 1.23","v":385.00229999999999},null,null,null,null,{"$f":"(SUM(H32:K32))","v":0},550,{"$f":"O32 / 1.23","v":313.01},{"$f":"G32 * (1-WS_DISCOUNT)","v":385.00229999999999},{"$f":"((SUM(H32:K32)) * O32)","v":0},null,null,null,null,null,null,null,null,null,null,null,null,null,null,null,"#ART","#MATKZ",null,null,null,"#DIM-QTY",null,null,null,"#POSMENGE",null,"#PREIS-313.01",null,"#POSWERT","#BEMERKUNG"]
[null,"N:68.1|68",370031,null,"SIGNATURE 5K blue/army grey",182.11,{"$f":"F33 * 1.23","v":223.99530000000001},null,null,null,null,{"$f":"(SUM(H33:K33))","v":0},320,{"$f":"O33 / 1.23","v":182.11},{"$f":"G33 * (1-WS_DISCOUNT)","v":223.99530000000001},{"$f":"((SUM(H33:K33)) * O33)","v":0},null,null,null,null,null,null,null,null,null,null,null,null,null,null,null,"#ART","#MATKZ",null,null,null,"#DIM-QTY",null,null,null,"#POSMENGE",null,"#PREIS-182.11",null,"#POSWERT","#BEMERKUNG"]
[null,"N:68.1|68",370021,null,"SIGNATURE 5K blue/black",182.11,{"$f":"F34 * 1.23","v":223.99530000000001},null,null,null,null,{"$f":"(SUM(H34:K34))","v":0},320,{"$f":"O34 / 1.23","v":182.11},{"$f":"G34 * (1-WS_DISCOUNT)","v":223.99530000000001},{"$f":"((SUM(H34:K34)) * O34)","v":0},null,null,null,null,null,null,null,null,null,null,null,null,null,null,null,"#ART","#MATKZ",null,null,null,"#DIM-QTY",null,null,null,"#POSMENGE",null,"#PREIS-182.11",null,"#POSWERT","#BEMERKUNG"]
[null,"N:68.1|68",370043,null,"SIGNATURE WCR",153.66,{"$f":"F35 * 1.23","v":189.0018},null,null,null,null,{"$f":"(SUM(H35:K35))","v":0},270,{"$f":"O35 / 1.23","v":153.66},{"$f":"G35 * (1-WS_DISCOUNT)","v":189.0018},{"$f":"((SUM(H35:K35)) * O35)","v":0},null,null,null,null,null,null,null,null,null,null,null,null,null,null,null,"#ART","#MATKZ",null,null,null,"#DIM-QTY",null,null,null,"#POSMENGE",null,"#PREIS-153.66",null,"#POSWERT","#BEMERKUNG"]
[null,"N:68.1|68",370061,null,"SIGNATURE black/olive",153.66,{"$f":"F36 * 1.23","v":189.0018},null,null,null,null,{"$f":"(SUM(H36:K36))","v":0},270,{"$f":"O36 / 1.23","v":153.66},{"$f":"G36 * (1-WS_DISCOUNT)","v":189.0018},{"$f":"((SUM(H36:K36)) * O36)","v":0},null,null,null,null,null,null,null,null,null,null,null,null,null,null,null,"#ART","#MATKZ",null,null,null,"#DIM-QTY",null,null,null,"#POSMENGE",null,"#PREIS-153.66",null,"#POSWERT","#BEMERKUNG"]

{"sheet":"KIJE","index":5,"n_rows":26,"n_cols":54,"rows_kept":26,"cut":false,"hidden":false,"merged":[[3,6,3,7],[3,8,3,14],[3,15,3,18],[3,19,3,22],[5,6,5,7],[5,8,5,14],[5,15,5,18],[5,19,5,22],[2,3,2,5],[2,6,2,7],[2,8,2,14],[2,15,2,18],[2,19,2,22],[3,3,3,5],[6,3,6,5],[6,8,6,14],[6,15,6,18],[6,19,6,22],[9,5,9,17],[4,3,5,5],[4,6,4,7],[4,8,4,14],[4,15,4,18],[4,19,4,22]]}
["#PRD","#INPUT","http://www.head.com/",null,{"$f":"KIJE!D1","v":0},null,null,"#DD1","#DD1","#DD1","#DD1","#DD1","#DD1","#DD1","#DD1","#DD1","#DD1","#DD1","#DD1",null,null,null,null,null,null,null,null,null,null,"#FIRST-ADDINFO-COL"]
[{"$f":"SUM(A10:A10)","v":0},{"$f":"SUM(B10:B10)","v":0},"   ",null,"   "]
["B3 has to be empty!!!",null,"Nr klienta",{"$f":"IF(F_CUST_NO=\"\",\"\",F_CUST_NO)","v":"NEW"},null,null,"Nr zamówienia",null,{"$f":"IF(F_ORDER_NO=\"\",\"\",F_ORDER_NO)","v":"PRE RACE 24/25"},null,null,null,null,null,null,"Data zamówienia",null,null,null,{"$f":"IF(F_ORDER_DATE<> \"\",F_ORDER_DATE,\"\")","v":""}]
["Empty Lines:",true,"Nazwa firmy",{"$f":"IF(F_CUST_NAME=\"\",\"\",F_CUST_NAME)","v":""},null,null,"Sales Rep.",null,{"$f":"IF(F_SALES_REP=\"\",\"\",F_SALES_REP)","v":"2694000|Sales Rep / Poland"},null,null,null,null,null,null,"Data dostawy",null,null,null,{"$f":"IF(F_DELDATE1<> \"\",F_DELDATE1,\"\")","v":""}]
["Delivery Date Total:",true,"Adres",{"$f":"IF(F_CUST_ADDR=\"\",\"\",F_CUST_ADDR)","v":""},null,null,null,null,null,null,null,null,null,null,null,null,null,null,null,{"$f":"IF(F_DELDATE2<> \"\",F_DELDATE2,\"\")","v":""}]
["Delivery Date 1:",true,"   ",null,null,null,"Zniżka",null,null,null,null,null,null,null,null,null,null,null,null,{"$f":"IF(F_DELDATE3<> \"\",F_DELDATE3,\"\")","v":""}]
["Delivery Date 2:",true]
["Delivery Date 3:",true]
[null,null,"HEAD Sport GmbH - Wuhrkopfweg 1 "]
[{"$f":"SUM($T$19:$T$26)","v":0},{"$f":"SUM($X$19:$X$26)","v":0},"Wuhrkopfweg 1 - A 6921 Kennelbach Austria",null,null,"KIJE -kod prod. to link do zdjęcia!"]
["Reserved DD2-QTTY","DD2-Amount","FN 64824 f"]
["Reserved DD3-QTTY","DD3-Amount"]
["Reserved DD4-QTTY","DD4-Amount"]
["Reserved DD5-QTTY","DD5-Amount"]
["Reserved DD6-QTTY","DD6-Amount"]
[]
["GH","N:41|","Kije"]
["H","N:41.1|41","Kod Art.",null,"Model","Cena Racing Netto","Cena Racing Brutto","QTY","090","095","100","105","110","115","120","125","130","135","140","Ilość","Rekomend. Cena Detaliczna","NET-Price","Price incl. VAT","Wartość","Uwagi"]
[null,"N:41.1|41",381054,null,"Worldcup SG",221.95,{"$f":"F19 * 1.23","v":272.99849999999998},null,null,null,null,null,null,null,null,null,null,null,null,{"$f":"(SUM(H19:S19))","v":0},390,{"$f":"W19 / 1.23","v":221.95},{"$f":"G19 * (1-WS_DISCOUNT)","v":272.99849999999998},{"$f":"((SUM(H19:S19)) * W19)","v":0},null,null,null,null,null,null,null,"#ART","#MATKZ",null,null,null,null,null,null,null,null,"#DIM-110","#DIM-115","#DIM-120","#DIM-125","#DIM-130","#DIM-135",null,"#POSMENGE",null,"#PREIS-221.95",null,"#POSWERT","#BEMERKUNG"]
[null,"N:41.1|41",381074,null,"Worldcup SL white",199.19,245.00369999999998,null,null,null,null,null,null,null,null,null,null,null,null,0,350,199.19,245.00369999999998,0,null,null,null,null,null,null,null,"#ART","#MATKZ",null,null,null,null,null,null,null,null,"#DIM-110","#DIM-115","#DIM-120","#DIM-125","#DIM-130","#DIM-135","#DIM-140","#POSMENGE",null,"#PREIS-199.19",null,"#POSWERT","#BEMERKUNG"]
[null,"N:41.1|41",381174,null,"Worldcup SL speed blue",199.19,245.00369999999998,null,null,null,null,null,null,null,null,null,null,null,null,0,350,199.19,245.00369999999998,0,null,null,null,null,null,null,null,"#ART","#MATKZ",null,null,null,null,null,null,null,null,"#DIM-110","#DIM-115","#DIM-120","#DIM-125","#DIM-130","#DIM-135","#DIM-140","#POSMENGE",null,"#PREIS-199.19",null,"#POSWERT","#BEMERKUNG"]
[null,"N:41.1|41",381204,null,"Worldcup Rebels Carbon white",369.92,455.0016,null,null,null,null,null,null,null,null,null,null,null,null,0,650,369.92,455.0016,0,null,null,null,null,null,null,null,"#ART","#MATKZ",null,null,null,null,null,null,null,"#DIM-105","#DIM-110","#DIM-115","#DIM-120","#DIM-125","#DIM-130","#DIM-135","#DIM-140","#POSMENGE",null,"#PREIS-369.92",null,"#POSWERT","#BEMERKUNG"]
[null,"N:41.1|41",381214,null,"Worldcup Rebels Carbon speed blue",369.92,455.0016,null,null,null,null,null,null,null,null,null,null,null,null,0,650,369.92,455.0016,0,null,null,null,null,null,null,null,"#ART","#MATKZ",null,null,null,null,null,null,null,"#DIM-105","#DIM-110","#DIM-115","#DIM-120","#DIM-125","#DIM-130","#DIM-135","#DIM-140","#POSMENGE",null,"#PREIS-369.92",null,"#POSWERT","#BEMERKUNG"]
[null,"N:41.1|41",381084,null,"Worldcup SL JR",136.59,168.00569999999999,null,null,null,null,null,null,null,null,null,null,null,null,0,240,136.59,168.00569999999999,0,null,null,null,null,null,null,null,"#ART","#MATKZ",null,null,null,null,"#DIM-090","#DIM-095","#DIM-100","#DIM-105","#DIM-110",null,null,null,null,null,null,"#POSMENGE",null,"#PREIS-136.59",null,"#POSWERT","#BEMERKUNG"]
[null,"N:41.1|41",381064,null,"Worldcup SG JR",136.59,168.00569999999999,null,null,null,null,null,null,null,null,null,null,null,null,0,240,136.59,168.00569999999999,0,null,null,null,null,null,null,null,"#ART","#MATKZ",null,null,null,null,"#DIM-090","#DIM-095","#DIM-100","#DIM-105","#DIM-110",null,null,null,null,null,null,"#POSMENGE",null,"#PREIS-136.59",null,"#POSWERT","#BEMERKUNG"]
[null,"N:41.1|41",381340,null,"HEAD WC SL Protector",159.35,196.00049999999999,null,null,null,null,null,null,null,null,null,null,null,null,0,280,159.35,196.00049999999999,0,null,null,null,null,null,null,null,"#ART","#MATKZ",null,null,null,"#DIM-QTY",null,null,null,null,null,null,null,null,null,null,null,"#POSMENGE",null,"#PREIS-159.35",null,"#POSWERT","#BEMERKUNG"]

{"sheet":"TORBY","index":6,"n_rows":29,"n_cols":44,"rows_kept":29,"cut":false,"hidden":false,"merged":[[3,6,3,7],[3,8,3,14],[3,15,3,18],[3,19,3,22],[5,6,5,7],[5,8,5,14],[5,15,5,18],[5,19,5,22],[2,3,2,5],[2,6,2,7],[2,8,2,14],[2,15,2,18],[2,19,2,22],[3,3,3,5],[6,3,6,5],[6,8,6,14],[6,15,6,18],[6,19,6,22],[9,5,9,17],[4,3,5,5],[4,6,4,7],[4,8,4,14],[4,15,4,18],[4,19,4,22]]}
["#PRD","#INPUT","http://www.head.com/",null,{"$f":"TORBY!D1","v":0},null,null,"#DD1","#DD1",null,null,null,null,null,null,null,null,null,null,null,null,null,null,null,null,null,null,null,null,"#FIRST-ADDINFO-COL"]
[{"$f":"SUM(A10:A10)","v":0},{"$f":"SUM(B10:B10)","v":0},"   ",null,"   "]
["B3 has to be empty!!!",null,"Nr klienta",{"$f":"IF(F_CUST_NO=\"\",\"\",F_CUST_NO)","v":"NEW"},null,null,"Nr zamówienia",null,{"$f":"IF(F_ORDER_NO=\"\",\"\",F_ORDER_NO)","v":"PRE RACE 24/25"},null,null,null,null,null,null,"Data zamówienia",null,null,null,{"$f":"IF(F_ORDER_DATE<> \"\",F_ORDER_DATE,\"\")","v":""}]
["Empty Lines:",true,"Nazwa firmy",{"$f":"IF(F_CUST_NAME=\"\",\"\",F_CUST_NAME)","v":""},null,null,"Sales Rep.",null,{"$f":"IF(F_SALES_REP=\"\",\"\",F_SALES_REP)","v":"2694000|Sales Rep / Poland"},null,null,null,null,null,null,"Data dostawy",null,null,null,{"$f":"IF(F_DELDATE1<> \"\",F_DELDATE1,\"\")","v":""}]
["Delivery Date Total:",true,"Adres",{"$f":"IF(F_CUST_ADDR=\"\",\"\",F_CUST_ADDR)","v":""},null,null,null,null,null,null,null,null,null,null,null,null,null,null,null,{"$f":"IF(F_DELDATE2<> \"\",F_DELDATE2,\"\")","v":""}]
["Delivery Date 1:",true,"   ",null,null,null,"Zniżka",null,null,null,null,null,null,null,null,null,null,null,null,{"$f":"IF(F_DELDATE3<> \"\",F_DELDATE3,\"\")","v":""}]
["Delivery Date 2:",true]
["Delivery Date 3:",true]
[null,null,"HEAD Sport GmbH - Wuhrkopfweg 1 "]
[{"$f":"SUM($J$19:$J$29)","v":0},{"$f":"SUM($N$19:$N$29)","v":0},"Wuhrkopfweg 1 - A 6921 Kennelbach Austria",null,null,"TORBY -kod prod. to link do zdjęcia!"]
["Reserved DD2-QTTY","DD2-Amount","FN 64824 f"]
["Reserved DD3-QTTY","DD3-Amount"]
["Reserved DD4-QTTY","DD4-Amount"]
["Reserved DD5-QTTY","DD5-Amount"]
["Reserved DD6-QTTY","DD6-Amount"]
[]
["GH","N:42|","Rebels Line"]
["H","N:42.1|42","Kod Art.",null,"Model","Cena Racing Netto","Cena Racing Brutto","QTY","230","Ilość","Rekomend. Cena Detaliczna","NET-Price","Price incl. VAT","Wartość","Uwagi"]
[null,"N:42.1|42",383034,null,"Rebels Racing Backpack L",364.23,{"$f":"F19 * 1.23","v":448.00290000000001},null,null,{"$f":"(SUM(H19:I19))","v":0},640,{"$f":"M19 / 1.23","v":364.23},{"$f":"G19 * (1-WS_DISCOUNT)","v":448.00290000000001},{"$f":"((SUM(H19:I19)) * M19)","v":0},null,null,null,null,null,null,null,null,null,null,null,null,null,null,null,null,null,"#ART","#MATKZ",null,null,null,"#DIM-QTY",null,"#POSMENGE",null,"#PREIS-364.23",null,"#POSWERT","#BEMERKUNG"]
[null,"N:42.1|42",383044,null,"Rebels Racing Backpack S",335.77,412.99709999999999,null,null,0,590,335.77,412.99709999999999,0,null,null,null,null,null,null,null,null,null,null,null,null,null,null,null,null,null,"#ART","#MATKZ",null,null,null,"#DIM-QTY",null,"#POSMENGE",null,"#PREIS-335.77",null,"#POSWERT","#BEMERKUNG"]
[null,"N:42.1|42",383964,null,"Rebels Coaches Backpack",506.5,622.995,null,null,0,890,506.5,622.995,0,null,null,null,null,null,null,null,null,null,null,null,null,null,null,null,null,null,"#ART","#MATKZ",null,null,null,"#DIM-QTY",null,"#POSMENGE",null,"#PREIS-506.5",null,"#POSWERT","#BEMERKUNG"]
[null,"N:42.1|42",383923,null,"Rebels Boot Carry On",147.97,182.00309999999999,null,null,0,260,147.97,182.00309999999999,0,null,null,null,null,null,null,null,null,null,null,null,null,null,null,null,null,null,"#ART","#MATKZ",null,null,null,"#DIM-QTY",null,"#POSMENGE",null,"#PREIS-147.97",null,"#POSWERT","#BEMERKUNG"]
[null,"N:42.1|42",383013,null,"Rebels Backpack",227.64,279.99719999999996,null,null,0,400,227.64,279.99719999999996,0,null,null,null,null,null,null,null,null,null,null,null,null,null,null,null,null,null,"#ART","#MATKZ",null,null,null,"#DIM-QTY",null,"#POSMENGE",null,"#PREIS-227.64",null,"#POSWERT","#BEMERKUNG"]
[null,"N:42.1|42",383193,null,"Heatable Bootbag",626.02,770.00459999999998,null,null,0,1100,626.02,770.00459999999998,0,null,null,null,null,null,null,null,null,null,null,null,null,null,null,null,null,null,"#ART","#MATKZ",null,null,null,null,"#DIM-230","#POSMENGE",null,"#PREIS-626.02",null,"#POSWERT","#BEMERKUNG"]
[null,"N:42.1|42",383003,null,"Rebels Travelbag",500.81,615.99630000000002,null,null,0,880,500.81,615.99630000000002,0,null,null,null,null,null,null,null,null,null,null,null,null,null,null,null,null,null,"#ART","#MATKZ",null,null,null,"#DIM-QTY",null,"#POSMENGE",null,"#PREIS-500.81",null,"#POSWERT","#BEMERKUNG"]
[null,"N:42.1|42",383023,null,"Rebels Double Skibag",358.54,441.00420000000003,null,null,0,630,358.54,441.00420000000003,0,null,null,null,null,null,null,null,null,null,null,null,null,null,null,null,null,null,"#ART","#MATKZ",null,null,null,"#DIM-QTY",null,"#POSMENGE",null,"#PREIS-358.54",null,"#POSWERT","#BEMERKUNG"]
[null,"N:42.1|42",383933,null,"Rebels Single Skibag",147.97,182.00309999999999,null,null,0,260,147.97,182.00309999999999,0,null,null,null,null,null,null,null,null,null,null,null,null,null,null,null,null,null,"#ART","#MATKZ",null,null,null,"#DIM-QTY",null,"#POSMENGE",null,"#PREIS-147.97",null,"#POSWERT","#BEMERKUNG"]
[null,"N:42.1|42",383953,null,"Rebels Single Skibag 180cm",147.97,182.00309999999999,null,null,0,260,147.97,182.00309999999999,0,null,null,null,null,null,null,null,null,null,null,null,null,null,null,null,null,null,"#ART","#MATKZ",null,null,null,"#DIM-QTY",null,"#POSMENGE",null,"#PREIS-147.97",null,"#POSWERT","#BEMERKUNG"]
[null,"N:42.1|42",383283,null,"SMU 4 Pairs Skibag",768.29,944.99669999999992,null,null,0,1350,768.29,944.99669999999992,0,null,null,null,null,null,null,null,null,null,null,null,null,null,null,null,null,null,"#ART","#MATKZ",null,null,null,"#DIM-QTY",null,"#POSMENGE",null,"#PREIS-768.29",null,"#POSWERT","#BEMERKUNG"]

{"sheet":"ODZIEŻ RACE","index":7,"n_rows":84,"n_cols":60,"rows_kept":84,"cut":false,"hidden":false,"merged":[[3,6,3,7],[3,8,3,14],[3,15,3,18],[3,19,3,22],[5,6,5,7],[5,8,5,14],[5,15,5,18],[5,19,5,22],[2,3,2,5],[2,6,2,7],[2,8,2,14],[2,15,2,18],[2,19,2,22],[3,3,3,5],[6,3,6,5],[6,8,6,14],[6,15,6,18],[6,19,6,22],[9,5,9,17],[4,3,5,5],[4,6,4,7],[4,8,4,14],[4,15,4,18],[4,19,4,22]]}
["#PRD","#INPUT","http://www.head.com/",null,{"$f":"'ODZIEŻ RACE'!D1","v":0},null,null,null,"#DD1","#DD1","#DD1","#DD1","#DD1","#DD1","#DD1","#DD1","#DD1","#DD1","#DD1","#DD1","#DD1","#DD1","#DD1",null,null,null,null,null,null,null,null,"#FIRST-ADDINFO-COL"]
[{"$f":"SUM(A10:A10)","v":0},{"$f":"SUM(B10:B10)","v":0},"   ",null,"   "]
["B3 has to be empty!!!",null,"Nr klienta",{"$f":"IF(F_CUST_NO=\"\",\"\",F_CUST_NO)","v":"NEW"},null,null,"Nr zamówienia",null,{"$f":"IF(F_ORDER_NO=\"\",\"\",F_ORDER_NO)","v":"PRE RACE 24/25"},null,null,null,null,null,null,"Data zamówienia",null,null,null,{"$f":"IF(F_ORDER_DATE<> \"\",F_ORDER_DATE,\"\")","v":""}]
["Empty Lines:",true,"Nazwa firmy",{"$f":"IF(F_CUST_NAME=\"\",\"\",F_CUST_NAME)","v":""},null,null,"Sales Rep.",null,{"$f":"IF(F_SALES_REP=\"\",\"\",F_SALES_REP)","v":"2694000|Sales Rep / Poland"},null,null,null,null,null,null,"Data dostawy",null,null,null,{"$f":"IF(F_DELDATE1<> \"\",F_DELDATE1,\"\")","v":""}]
["Delivery Date Total:",true,"Adres",{"$f":"IF(F_CUST_ADDR=\"\",\"\",F_CUST_ADDR)","v":""},null,null,null,null,null,null,null,null,null,null,null,null,null,null,null,{"$f":"IF(F_DELDATE2<> \"\",F_DELDATE2,\"\")","v":""}]
["Delivery Date 1:",true,"   ",null,null,null,"Zniżka",null,null,null,null,null,null,null,null,null,null,null,null,{"$f":"IF(F_DELDATE3<> \"\",F_DELDATE3,\"\")","v":""}]
["Delivery Date 2:",true]
["Delivery Date 3:",true]
[null,null,"HEAD Sport GmbH - Wuhrkopfweg 1 "]
[{"$f":"SUM($X$19:$X$37)+SUM($X$40:$X$61)+SUM($X$64:$X$72)+SUM($X$75:$X$84)","v":0},{"$f":"SUM($AB$19:$AB$37)+SUM($AB$40:$AB$61)+SUM($AB$64:$AB$72)+SUM($AB$75:$AB$84)","v":0},"Wuhrkopfweg 1 - A 6921 Kennelbach Austria",null,null,"ODZIEŻ RACE -kod prod. to link do zdjęcia!"]
["Reserved DD2-QTTY","DD2-Amount","FN 64824 f"]
["Reserved DD3-QTTY","DD3-Amount"]
["Reserved DD4-QTTY","DD4-Amount"]
["Reserved DD5-QTTY","DD5-Amount"]
["Reserved DD6-QTTY","DD6-Amount"]
[]
["GH","N:58|","Unisex"]
["H","N:58.1|58","Kod Art.",null,"Model","Kolor","Cena Racing Netto","Cena Racing Brutto","QTY","XS","S","M","M/L","L","XL","XXL","","","","","","","","Ilość","Rekomend. Cena Detaliczna","NET-Price","Price incl. VAT","Wartość","Uwagi"]
[null,"N:58.1|58",821504,null,"RACE FIS Suit Unisex","YVBK",1524.39,{"$f":"G19 * 1.23","v":1874.9997000000001},null,null,null,null,null,null,null,null,null,null,null,null,null,null,null,{"$f":"(SUM(I19:W19))","v":0},2500,{"$f":"AA19 / 1.23","v":1524.39},{"$f":"H19 * (1-WS_DISCOUNT)","v":1874.9997000000001},{"$f":"((SUM(I19:W19)) * AA19)","v":0},null,null,null,null,null,"#ART","#MATKZ",null,null,null,null,null,"#DIM-YVBKXS","#DIM-YVBKS","#DIM-YVBKM",null,"#DIM-YVBKL","#DIM-YVBKXL","#DIM-YVBKXXL",null,null,null,null,null,null,null,"#POSMENGE",null,"#PREIS-1524.39",null,"#POSWERT","#BEMERKUNG"]
[null,"N:58.1|58",821514,null,"RACE FIS Suit unpadded Unisex","YVBK",1402.44,1725.0012000000002,null,null,null,null,null,null,null,null,null,null,null,null,null,null,null,0,2300,1402.44,1725.0012000000002,0,null,null,null,null,null,"#ART","#MATKZ",null,null,null,null,null,"#DIM-YVBKXS","#DIM-YVBKS","#DIM-YVBKM",null,"#DIM-YVBKL","#DIM-YVBKXL","#DIM-YVBKXXL",null,null,null,null,null,null,null,"#POSMENGE",null,"#PREIS-1402.44",null,"#POSWERT","#BEMERKUNG"]
[null,"N:58.1|58",821524,null,"RACE Suit Unisex","YVBK",1128.05,1387.5014999999999,null,null,null,null,null,null,null,null,null,null,null,null,null,null,null,0,1850,1128.05,1387.5014999999999,0,null,null,null,null,null,"#ART","#MATKZ",null,null,null,null,null,"#DIM-YVBKXS","#DIM-YVBKS","#DIM-YVBKM",null,"#DIM-YVBKL","#DIM-YVBKXL","#DIM-YVBKXXL",null,null,null,null,null,null,null,"#POSMENGE",null,"#PREIS-1128.05",null,"#POSWERT","#BEMERKUNG"]
[null,"N:58.1|58",821544,null,"RACE Shorts Unisex","BK",518.29,637.49669999999992,null,null,null,null,null,null,null,null,null,null,null,null,null,null,null,0,850,518.29,637.49669999999992,0,null,null,null,null,null,"#ART","#MATKZ",null,null,null,null,null,"#DIM-BK  XS","#DIM-BK  S","#DIM-BK  M",null,"#DIM-BK  L","#DIM-BK  XL","#DIM-BK  XXL",null,null,null,null,null,null,null,"#POSMENGE",null,"#PREIS-518.29",null,"#POSWERT","#BEMERKUNG"]
[null,"N:58.1|58",821534,null,"RACE Rain Coat Unisex","BK",609.76,750.00479999999993,null,null,null,null,null,null,null,null,null,null,null,null,null,null,null,0,1000,609.76,750.00479999999993,0,null,null,null,null,null,"#ART","#MATKZ",null,null,null,null,null,"#DIM-BK  XS","#DIM-BK  S","#DIM-BK  M",null,"#DIM-BK  L","#DIM-BK  XL","#DIM-BK  XXL",null,null,null,null,null,null,null,"#POSMENGE",null,"#PREIS-609.76",null,"#POSWERT","#BEMERKUNG"]
[null,"N:58.1|58",821534,null,"RACE Rain Coat Unisex","BL",609.76,750.00479999999993,null,null,null,null,null,null,null,null,null,null,null,null,null,null,null,0,1000,609.76,750.00479999999993,0,null,null,null,null,null,"#ART","#MATKZ",null,null,null,null,null,"#DIM-BL  XS","#DIM-BL  S","#DIM-BL  M",null,"#DIM-BL  L","#DIM-BL  XL","#DIM-BL  XXL",null,null,null,null,null,null,null,"#POSMENGE",null,"#PREIS-609.76",null,"#POSWERT","#BEMERKUNG"]
[null,"N:58.1|58",821322,null,"RACE ZIP Pants Men","BK",975.61,1200.0002999999999,null,null,null,null,null,null,null,null,null,null,null,null,null,null,null,0,1600,975.6099999999999,1200.0002999999999,0,null,null,null,null,null,"#ART","#MATKZ",null,null,null,null,null,null,"#DIM-BK  S","#DIM-BK  M","#DIM-BK  M/L","#DIM-BK  L","#DIM-BK  XL","#DIM-BK  XXL",null,null,null,null,null,null,null,"#POSMENGE",null,"#PREIS-975.61",null,"#POSWERT","#BEMERKUNG"]
[null,"N:58.1|58",821564,null,"RACE Hoodie Unisex","BK",280.49,345.0027,null,null,null,null,null,null,null,null,null,null,null,null,null,null,null,0,460,280.49,345.0027,0,null,null,null,null,null,"#ART","#MATKZ",null,null,null,null,null,"#DIM-BK  XS","#DIM-BK  S","#DIM-BK  M",null,"#DIM-BK  L","#DIM-BK  XL","#DIM-BK  XXL",null,null,null,null,null,null,null,"#POSMENGE",null,"#PREIS-280.49",null,"#POSWERT","#BEMERKUNG"]
[null,"N:58.1|58",821564,null,"RACE Hoodie Unisex","BL",280.49,345.0027,null,null,null,null,null,null,null,null,null,null,null,null,null,null,null,0,460,280.49,345.0027,0,null,null,null,null,null,"#ART","#MATKZ",null,null,null,null,null,"#DIM-BL  XS","#DIM-BL  S","#DIM-BL  M",null,"#DIM-BL  L","#DIM-BL  XL","#DIM-BL  XXL",null,null,null,null,null,null,null,"#POSMENGE",null,"#PREIS-280.49",null,"#POSWERT","#BEMERKUNG"]
[null,"N:58.1|58",821564,null,"RACE Hoodie Unisex","WH",280.49,345.0027,null,null,null,null,null,null,null,null,null,null,null,null,null,null,null,0,460,280.49,345.0027,0,null,null,null,null,null,"#ART","#MATKZ",null,null,null,null,null,"#DIM-WH  XS","#DIM-WH  S","#DIM-WH  M",null,"#DIM-WH  L","#DIM-WH  XL","#DIM-WH  XXL",null,null,null,null,null,null,null,"#POSMENGE",null,"#PREIS-280.49",null,"#POSWERT","#BEMERKUNG"]
[null,"N:58.1|58",821992,null,"RACE SERVICE JOGGING Pants","BK",420.73,517.49789999999996,null,null,null,null,null,null,null,null,null,null,null,null,null,null,null,0,690,420.72999999999996,517.49789999999996,0,null,null,null,null,null,"#ART","#MATKZ",null,null,null,null,null,null,"#DIM-BK  S","#DIM-BK  M","#DIM-BK  M/L","#DIM-BK  L","#DIM-BK  XL","#DIM-BK  XXL",null,null,null,null,null,null,null,"#POSMENGE",null,"#PREIS-420.73",null,"#POSWERT","#BEMERKUNG"]
[null,"N:58.1|58",821634,null,"HEAD FZ Hoodie Unisex","BK",335.37,412.50510000000003,null,null,null,null,null,null,null,null,null,null,null,null,null,null,null,0,550,335.37,412.50510000000003,0,null,null,null,null,null,"#ART","#MATKZ",null,null,null,null,null,"#DIM-BK  XS","#DIM-BK  S","#DIM-BK  M",null,"#DIM-BK  L","#DIM-BK  XL","#DIM-BK  XXL",null,null,null,null,null,null,null,"#POSMENGE",null,"#PREIS-335.37",null,"#POSWERT","#BEMERKUNG"]
[null,"N:58.1|58",821654,null,"WCR Hoodie Unisex","BK",280.49,345.0027,null,null,null,null,null,null,null,null,null,null,null,null,null,null,null,0,460,280.49,345.0027,0,null,null,null,null,null,"#ART","#MATKZ",null,null,null,null,null,"#DIM-BK  XS","#DIM-BK  S","#DIM-BK  M",null,"#DIM-BK  L","#DIM-BK  XL","#DIM-BK  XXL",null,null,null,null,null,null,null,"#POSMENGE",null,"#PREIS-280.49",null,"#POSWERT","#BEMERKUNG"]
[null,"N:58.1|58",827169,null,"HEAD Beanie","DYBK",100.98,124.2054,null,null,null,null,null,null,null,null,null,null,null,null,null,null,null,0,180,100.98,124.2054,0,null,null,null,null,null,"#ART","#MATKZ",null,null,null,null,"#DIM-DYBK",null,null,null,null,null,null,null,null,null,null,null,null,null,null,"#POSMENGE",null,"#PREIS-100.98",null,"#POSWERT","#BEMERKUNG"]
[null,"N:58.1|58",827169,null,"HEAD Beanie","OCBK",100.98,124.2054,null,null,null,null,null,null,null,null,null,null,null,null,null,null,null,0,180,100.98,124.2054,0,null,null,null,null,null,"#ART","#MATKZ",null,null,null,null,"#DIM-OCBK",null,null,null,null,null,null,null,null,null,null,null,null,null,null,"#POSMENGE",null,"#PREIS-100.98",null,"#POSWERT","#BEMERKUNG"]
[null,"N:58.1|58",827169,null,"HEAD Beanie","OLBK",100.98,124.2054,null,null,null,null,null,null,null,null,null,null,null,null,null,null,null,0,180,100.98,124.2054,0,null,null,null,null,null,"#ART","#MATKZ",null,null,null,null,"#DIM-OLBK",null,null,null,null,null,null,null,null,null,null,null,null,null,null,"#POSMENGE",null,"#PREIS-100.98",null,"#POSWERT","#BEMERKUNG"]
[null,"N:58.1|58",827169,null,"HEAD Beanie","RDBK",100.98,124.2054,null,null,null,null,null,null,null,null,null,null,null,null,null,null,null,0,180,100.98,124.2054,0,null,null,null,null,null,"#ART","#MATKZ",null,null,null,null,"#DIM-RDBK",null,null,null,null,null,null,null,null,null,null,null,null,null,null,"#POSMENGE",null,"#PREIS-100.98",null,"#POSWERT","#BEMERKUNG"]
[null,"N:58.1|58",827169,null,"HEAD Beanie","WHBK",100.98,124.2054,null,null,null,null,null,null,null,null,null,null,null,null,null,null,null,0,180,100.98,124.2054,0,null,null,null,null,null,"#ART","#MATKZ",null,null,null,null,"#DIM-WHBK",null,null,null,null,null,null,null,null,null,null,null,null,null,null,"#POSMENGE",null,"#PREIS-100.98",null,"#POSWERT","#BEMERKUNG"]
[null,"N:58.1|58",828018,null,"Flexion Suspenders","BK",100.98,124.2054,null,null,null,null,null,null,null,null,null,null,null,null,null,null,null,0,180,100.98,124.2054,0,null,null,null,null,null,"#ART","#MATKZ",null,null,null,null,"#DIM-BK",null,null,null,null,null,null,null,null,null,null,null,null,null,null,"#POSMENGE",null,"#PREIS-100.98",null,"#POSWERT","#BEMERKUNG"]
["GH","N:69|","MEN"]
["H","N:69.1|69","Kod Art.",null,"Model","Kolor","Cena Racing Netto","Cena Racing Brutto","42","44","46","48","50","52","54","56","58","S","M","M/L","L","XL","XXL","Ilość","Rekomend. Cena Detaliczna","NET-Price","Price incl. VAT","Wartość","Uwagi"]
[null,"N:69.1|69",821624,null,"RACE SOFTSHELL Jacket Men","BK",701.22,{"$f":"G40 * 1.23","v":862.50060000000008},null,null,null,null,null,null,null,null,null,null,null,null,null,null,null,{"$f":"(SUM(I40:W40))","v":0},1150,{"$f":"AA40 / 1.23","v":701.22},{"$f":"H40 * (1-WS_DISCOUNT)","v":862.50060000000008},{"$f":"((SUM(I40:W40)) * AA40)","v":0},null,null,null,null,null,"#ART","#MATKZ",null,null,null,null,null,null,"#DIM-BK  46","#DIM-BK  48","#DIM-BK  50","#DIM-BK  52","#DIM-BK  54","#DIM-BK  56","#DIM-BK  58",null,null,null,null,null,null,"#POSMENGE",null,"#PREIS-701.22",null,"#POSWERT","#BEMERKUNG"]
[null,"N:69.1|69",821252,null,"RACE TEAM Jacket Men","BK",1768.29,2174.9967000000001,null,null,null,null,null,null,null,null,null,null,null,null,null,null,null,0,2900,1768.2900000000002,2174.9967000000001,0,null,null,null,null,null,"#ART","#MATKZ",null,null,null,null,null,null,null,null,null,null,null,null,null,"#DIM-BK  S","#DIM-BK  M","#DIM-BK  M/L","#DIM-BK  L","#DIM-BK  XL","#DIM-BK  XXL","#POSMENGE",null,"#PREIS-1768.29",null,"#POSWERT","#BEMERKUNG"]
[null,"N:69.1|69",821262,null,"RACE TEAM Pants Men","BK",1524.39,1874.9997000000001,null,null,null,null,null,null,null,null,null,null,null,null,null,null,null,0,2500,1524.39,1874.9997000000001,0,null,null,null,null,null,"#ART","#MATKZ",null,null,null,null,null,null,null,null,null,null,null,null,null,"#DIM-BK  S","#DIM-BK  M","#DIM-BK  M/L","#DIM-BK  L","#DIM-BK  XL","#DIM-BK  XXL","#POSMENGE",null,"#PREIS-1524.39",null,"#POSWERT","#BEMERKUNG"]
[null,"N:69.1|69",821574,null,"RACE NOVA Jacket Men","BKBL",1341.46,1649.9957999999999,null,null,null,null,null,null,null,null,null,null,null,null,null,null,null,0,2200,1341.46,1649.9957999999999,0,null,null,null,null,null,"#ART","#MATKZ",null,null,null,null,"#DIM-BKBL42","#DIM-BKBL44","#DIM-BKBL46","#DIM-BKBL48","#DIM-BKBL50","#DIM-BKBL52","#DIM-BKBL54","#DIM-BKBL56","#DIM-BKBL58",null,null,null,null,null,null,"#POSMENGE",null,"#PREIS-1341.46",null,"#POSWERT","#BEMERKUNG"]
[null,"N:69.1|69",821574,null,"RACE NOVA Jacket Men","BKDY",1341.46,1649.9957999999999,null,null,null,null,null,null,null,null,null,null,null,null,null,null,null,0,2200,1341.46,1649.9957999999999,0,null,null,null,null,null,"#ART","#MATKZ",null,null,null,null,"#DIM-BKDY42","#DIM-BKDY44","#DIM-BKDY46","#DIM-BKDY48","#DIM-BKDY50","#DIM-BKDY52","#DIM-BKDY54","#DIM-BKDY56","#DIM-BKDY58",null,null,null,null,null,null,"#POSMENGE",null,"#PREIS-1341.46",null,"#POSWERT","#BEMERKUNG"]
[null,"N:69.1|69",821574,null,"RACE NOVA Jacket Men","BKWH",1341.46,1649.9957999999999,null,null,null,null,null,null,null,null,null,null,null,null,null,null,null,0,2200,1341.46,1649.9957999999999,0,null,null,null,null,null,"#ART","#MATKZ",null,null,null,null,"#DIM-BKWH42","#DIM-BKWH44","#DIM-BKWH46","#DIM-BKWH48","#DIM-BKWH50","#DIM-BKWH52","#DIM-BKWH54","#DIM-BKWH56","#DIM-BKWH58",null,null,null,null,null,null,"#POSMENGE",null,"#PREIS-1341.46",null,"#POSWERT","#BEMERKUNG"]
[null,"N:69.1|69",821584,null,"RACE NOVA Pants Men","BKBL",1036.5899999999999,1275.0056999999999,null,null,null,null,null,null,null,null,null,null,null,null,null,null,null,0,1700,1036.5899999999999,1275.0056999999999,0,null,null,null,null,null,"#ART","#MATKZ",null,null,null,null,"#DIM-BKBL42","#DIM-BKBL44","#DIM-BKBL46","#DIM-BKBL48","#DIM-BKBL50","#DIM-BKBL52","#DIM-BKBL54","#DIM-BKBL56","#DIM-BKBL58",null,null,null,null,null,null,"#POSMENGE",null,"#PREIS-1036.59",null,"#POSWERT","#BEMERKUNG"]
[null,"N:69.1|69",821584,null,"RACE NOVA Pants Men","BKDY",1036.5899999999999,1275.0056999999999,null,null,null,null,null,null,null,null,null,null,null,null,null,null,null,0,1700,1036.5899999999999,1275.0056999999999,0,null,null,null,null,null,"#ART","#MATKZ",null,null,null,null,"#DIM-BKDY42","#DIM-BKDY44","#DIM-BKDY46","#DIM-BKDY48","#DIM-BKDY50","#DIM-BKDY52","#DIM-BKDY54","#DIM-BKDY56","#DIM-BKDY58",null,null,null,null,null,null,"#POSMENGE",null,"#PREIS-1036.59",null,"#POSWERT","#BEMERKUNG"]
[null,"N:69.1|69",821584,null,"RACE NOVA Pants Men","BKWH",1036.5899999999999,1275.0056999999999,null,null,null,null,null,null,null,null,null,null,null,null,null,null,null,0,1700,1036.5899999999999,1275.0056999999999,0,null,null,null,null,null,"#ART","#MATKZ",null,null,null,null,"#DIM-BKWH42","#DIM-BKWH44","#DIM-BKWH46","#DIM-BKWH48","#DIM-BKWH50","#DIM-BKWH52","#DIM-BKWH54","#DIM-BKWH56","#DIM-BKWH58",null,null,null,null,null,null,"#POSMENGE",null,"#PREIS-1036.59",null,"#POSWERT","#BEMERKUNG"]
[null,"N:69.1|69",821924,null,"STAR Jacket Men","BK",897.56,1103.9987999999998,null,null,null,null,null,null,null,null,null,null,null,null,null,null,null,0,1600,897.55999999999983,1103.9987999999998,0,null,null,null,null,null,"#ART","#MATKZ",null,null,null,null,null,null,"#DIM-BK  46","#DIM-BK  48","#DIM-BK  50","#DIM-BK  52","#DIM-BK  54","#DIM-BK  56","#DIM-BK  58",null,null,null,null,null,null,"#POSMENGE",null,"#PREIS-897.56",null,"#POSWERT","#BEMERKUNG"]
[null,"N:69.1|69",821924,null,"STAR Jacket Men","BL",897.56,1103.9987999999998,null,null,null,null,null,null,null,null,null,null,null,null,null,null,null,0,1600,897.55999999999983,1103.9987999999998,0,null,null,null,null,null,"#ART","#MATKZ",null,null,null,null,null,null,"#DIM-BL  46","#DIM-BL  48","#DIM-BL  50","#DIM-BL  52","#DIM-BL  54","#DIM-BL  56","#DIM-BL  58",null,null,null,null,null,null,"#POSMENGE",null,"#PREIS-897.56",null,"#POSWERT","#BEMERKUNG"]
[null,"N:69.1|69",821924,null,"STAR Jacket Men","DY",897.56,1103.9987999999998,null,null,null,null,null,null,null,null,null,null,null,null,null,null,null,0,1600,897.55999999999983,1103.9987999999998,0,null,null,null,null,null,"#ART","#MATKZ",null,null,null,null,null,null,null,"#DIM-DY  48","#DIM-DY  50","#DIM-DY  52","#DIM-DY  54",null,null,null,null,null,null,null,null,"#POSMENGE",null,"#PREIS-897.56",null,"#POSWERT","#BEMERKUNG"]
[null,"N:69.1|69",821572,null,"REBELS STAR Coat Men","BK",1158.54,1425.0041999999999,null,null,null,null,null,null,null,null,null,null,null,null,null,null,null,0,1900,1158.54,1425.0041999999999,0,null,null,null,null,null,"#ART","#MATKZ",null,null,null,null,null,null,null,null,null,null,null,null,null,"#DIM-BK  S","#DIM-BK  M","#DIM-BK  M/L","#DIM-BK  L","#DIM-BK  XL","#DIM-BK  XXL","#POSMENGE",null,"#PREIS-1158.54",null,"#POSWERT","#BEMERKUNG"]
[null,"N:69.1|69",821572,null,"REBELS STAR Coat Men","TY",1158.54,1425.0041999999999,null,null,null,null,null,null,null,null,null,null,null,null,null,null,null,0,1900,1158.54,1425.0041999999999,0,null,null,null,null,null,"#ART","#MATKZ",null,null,null,null,null,null,null,null,null,null,null,null,null,"#DIM-TY  S","#DIM-TY  M","#DIM-TY  M/L","#DIM-TY  L","#DIM-TY  XL","#DIM-TY  XXL","#POSMENGE",null,"#PREIS-1158.54",null,"#POSWERT","#BEMERKUNG"]
[null,"N:69.1|69",821543,null,"RACE STAR Vest Men","YVBK",524.39,644.99969999999996,null,null,null,null,null,null,null,null,null,null,null,null,null,null,null,0,860,524.39,644.99969999999996,0,null,null,null,null,null,"#ART","#MATKZ",null,null,null,null,null,null,null,null,null,null,null,null,null,"#DIM-YVBKS","#DIM-YVBKM","#DIM-YVBKM/L","#DIM-YVBKL","#DIM-YVBKXL","#DIM-YVBKXXL","#POSMENGE",null,"#PREIS-524.39",null,"#POSWERT","#BEMERKUNG"]
[null,"N:69.1|69",821604,null,"RACE KINETIC Jacket Men","BK",560.98,690.00540000000001,null,null,null,null,null,null,null,null,null,null,null,null,null,null,null,0,920,560.98,690.00540000000001,0,null,null,null,null,null,"#ART","#MATKZ",null,null,null,null,null,null,"#DIM-BK  46","#DIM-BK  48","#DIM-BK  50","#DIM-BK  52","#DIM-BK  54","#DIM-BK  56","#DIM-BK  58",null,null,null,null,null,null,"#POSMENGE",null,"#PREIS-560.98",null,"#POSWERT","#BEMERKUNG"]
[null,"N:69.1|69",821604,null,"RACE KINETIC Jacket Men","BLWH",560.98,690.00540000000001,null,null,null,null,null,null,null,null,null,null,null,null,null,null,null,0,920,560.98,690.00540000000001,0,null,null,null,null,null,"#ART","#MATKZ",null,null,null,null,null,null,"#DIM-BLWH46","#DIM-BLWH48","#DIM-BLWH50","#DIM-BLWH52","#DIM-BLWH54","#DIM-BLWH56","#DIM-BLWH58",null,null,null,null,null,null,"#POSMENGE",null,"#PREIS-560.98",null,"#POSWERT","#BEMERKUNG"]
[null,"N:69.1|69",821664,null,"RACE T-Shirt Men","BK",121.95,149.99850000000001,null,null,null,null,null,null,null,null,null,null,null,null,null,null,null,0,200,121.95,149.99850000000001,0,null,null,null,null,null,"#ART","#MATKZ",null,null,null,null,null,null,"#DIM-BK  46","#DIM-BK  48","#DIM-BK  50","#DIM-BK  52","#DIM-BK  54","#DIM-BK  56","#DIM-BK  58",null,null,null,null,null,null,"#POSMENGE",null,"#PREIS-121.95",null,"#POSWERT","#BEMERKUNG"]
[null,"N:69.1|69",811913,null,"FLEX Seamless LS Men","BK",159.35,196.00049999999999,null,null,null,null,null,null,null,null,null,null,null,null,null,null,null,0,280,159.35,196.00049999999999,0,null,null,null,null,null,"#ART","#MATKZ",null,null,null,null,null,null,null,null,null,null,null,null,null,null,"#DIM-BK  M",null,"#DIM-BK  L","#DIM-BK  XL",null,"#POSMENGE",null,"#PREIS-159.35",null,"#POSWERT","#BEMERKUNG"]
[null,"N:69.1|69",811913,null,"FLEX Seamless LS Men","NV",159.35,196.00049999999999,null,null,null,null,null,null,null,null,null,null,null,null,null,null,null,0,280,159.35,196.00049999999999,0,null,null,null,null,null,"#ART","#MATKZ",null,null,null,null,null,null,null,null,null,null,null,null,null,null,"#DIM-NV  M",null,"#DIM-NV  L","#DIM-NV  XL",null,"#POSMENGE",null,"#PREIS-159.35",null,"#POSWERT","#BEMERKUNG"]
[null,"N:69.1|69",811913,null,"FLEX Seamless LS Men","WH",159.35,196.00049999999999,null,null,null,null,null,null,null,null,null,null,null,null,null,null,null,0,280,159.35,196.00049999999999,0,null,null,null,null,null,"#ART","#MATKZ",null,null,null,null,null,null,null,null,null,null,null,null,null,null,"#DIM-WH  M",null,"#DIM-WH  L","#DIM-WH  XL",null,"#POSMENGE",null,"#PREIS-159.35",null,"#POSWERT","#BEMERKUNG"]
[null,"N:69.1|69",821672,null,"PROMO HEAD Vest Men","BK",420.73,517.49789999999996,null,null,null,null,null,null,null,null,null,null,null,null,null,null,null,0,690,420.72999999999996,517.49789999999996,0,null,null,null,null,null,"#ART","#MATKZ",null,null,null,null,null,null,null,null,null,null,null,null,null,"#DIM-BK  S","#DIM-BK  M",null,"#DIM-BK  L","#DIM-BK  XL","#DIM-BK  XXL","#POSMENGE",null,"#PREIS-420.73",null,"#POSWERT","#BEMERKUNG"]
["GH","N:70|","WOMEN"]
["H","N:70.1|70","Kod Art.",null,"Model","Kolor","Cena Racing Netto","Cena Racing Brutto","34","36","38","40","42","44","46","XS","S","S/M","M","L","XL","XXL","","Ilość","Rekomend. Cena Detaliczna","NET-Price","Price incl. VAT","Wartość","Uwagi"]
[null,"N:70.1|70",824563,null,"RACE STAR Jacket Women","BK",897.56,{"$f":"G64 * 1.23","v":1103.9987999999998},null,null,null,null,null,null,null,null,null,null,null,null,null,null,null,{"$f":"(SUM(I64:W64))","v":0},1600,{"$f":"AA64 / 1.23","v":897.55999999999983},{"$f":"H64 * (1-WS_DISCOUNT)","v":1103.9987999999998},{"$f":"((SUM(I64:W64)) * AA64)","v":0},null,null,null,null,null,"#ART","#MATKZ",null,null,null,null,null,null,null,null,null,null,null,"#DIM-BK  XS","#DIM-BK  S","#DIM-BK  S/M","#DIM-BK  M","#DIM-BK  L","#DIM-BK  XL","#DIM-BK  XXL",null,"#POSMENGE",null,"#PREIS-897.56",null,"#POSWERT","#BEMERKUNG"]
[null,"N:70.1|70",824563,null,"RACE STAR Jacket Women","BL",897.56,1103.9987999999998,null,null,null,null,null,null,null,null,null,null,null,null,null,null,null,0,1600,897.55999999999983,1103.9987999999998,0,null,null,null,null,null,"#ART","#MATKZ",null,null,null,null,null,null,null,null,null,null,null,"#DIM-BL  XS","#DIM-BL  S","#DIM-BL  S/M","#DIM-BL  M","#DIM-BL  L","#DIM-BL  XL","#DIM-BL  XXL",null,"#POSMENGE",null,"#PREIS-897.56",null,"#POSWERT","#BEMERKUNG"]
[null,"N:70.1|70",824642,null,"REBELS STAR Coat Women","BK",1158.54,1425.0041999999999,null,null,null,null,null,null,null,null,null,null,null,null,null,null,null,0,1900,1158.54,1425.0041999999999,0,null,null,null,null,null,"#ART","#MATKZ",null,null,null,null,null,null,null,null,null,null,null,"#DIM-BK  XS","#DIM-BK  S","#DIM-BK  S/M","#DIM-BK  M","#DIM-BK  L","#DIM-BK  XL","#DIM-BK  XXL",null,"#POSMENGE",null,"#PREIS-1158.54",null,"#POSWERT","#BEMERKUNG"]
[null,"N:70.1|70",824642,null,"REBELS STAR Coat Women","TY",1158.54,1425.0041999999999,null,null,null,null,null,null,null,null,null,null,null,null,null,null,null,0,1900,1158.54,1425.0041999999999,0,null,null,null,null,null,"#ART","#MATKZ",null,null,null,null,null,null,null,null,null,null,null,"#DIM-TY  XS","#DIM-TY  S","#DIM-TY  S/M","#DIM-TY  M","#DIM-TY  L","#DIM-TY  XL","#DIM-TY  XXL",null,"#POSMENGE",null,"#PREIS-1158.54",null,"#POSWERT","#BEMERKUNG"]
[null,"N:70.1|70",824492,null,"RACE KINETIC Jacket Women","BK",560.98,690.00540000000001,null,null,null,null,null,null,null,null,null,null,null,null,null,null,null,0,920,560.98,690.00540000000001,0,null,null,null,null,null,"#ART","#MATKZ",null,null,null,null,null,null,null,null,null,null,null,"#DIM-BK  XS","#DIM-BK  S","#DIM-BK  S/M","#DIM-BK  M","#DIM-BK  L","#DIM-BK  XL","#DIM-BK  XXL",null,"#POSMENGE",null,"#PREIS-560.98",null,"#POSWERT","#BEMERKUNG"]
[null,"N:70.1|70",814913,null,"FLEX Seamless LS Women","BK",159.35,196.00049999999999,null,null,null,null,null,null,null,null,null,null,null,null,null,null,null,0,280,159.35,196.00049999999999,0,null,null,null,null,null,"#ART","#MATKZ",null,null,null,null,null,null,null,null,null,null,null,null,"#DIM-BK  S",null,"#DIM-BK  M","#DIM-BK  L",null,null,null,"#POSMENGE",null,"#PREIS-159.35",null,"#POSWERT","#BEMERKUNG"]
[null,"N:70.1|70",814913,null,"FLEX Seamless LS Women","NV",159.35,196.00049999999999,null,null,null,null,null,null,null,null,null,null,null,null,null,null,null,0,280,159.35,196.00049999999999,0,null,null,null,null,null,"#ART","#MATKZ",null,null,null,null,null,null,null,null,null,null,null,null,"#DIM-NV  S",null,"#DIM-NV  M","#DIM-NV  L",null,null,null,"#POSMENGE",null,"#PREIS-159.35",null,"#POSWERT","#BEMERKUNG"]
[null,"N:70.1|70",814913,null,"FLEX Seamless LS Women","WH",159.35,196.00049999999999,null,null,null,null,null,null,null,null,null,null,null,null,null,null,null,0,280,159.35,196.00049999999999,0,null,null,null,null,null,"#ART","#MATKZ",null,null,null,null,null,null,null,null,null,null,null,null,"#DIM-WH  S",null,"#DIM-WH  M","#DIM-WH  L",null,null,null,"#POSMENGE",null,"#PREIS-159.35",null,"#POSWERT","#BEMERKUNG"]
[null,"N:70.1|70",824544,null,"WCR T-Shirt Women","BL",121.95,149.99850000000001,null,null,null,null,null,null,null,null,null,null,null,null,null,null,null,0,200,121.95,149.99850000000001,0,null,null,null,null,null,"#ART","#MATKZ",null,null,null,null,"#DIM-BL  34","#DIM-BL  36","#DIM-BL  38","#DIM-BL  40","#DIM-BL  42","#DIM-BL  44","#DIM-BL  46",null,null,null,null,null,null,null,null,"#POSMENGE",null,"#PREIS-121.95",null,"#POSWERT","#BEMERKUNG"]
["GH","N:59|","JUNIOR"]
["H","N:59.1|59","Kod Art.",null,"Model","Kolor","Cena Racing Netto","Cena Racing Brutto","128","140","152","164","176","","","","","","","","","","","Ilość","Rekomend. Cena Detaliczna","NET-Price","Price incl. VAT","Wartość","Uwagi"]
[null,"N:59.1|59",826504,null,"RACE Suit Junior","YVBK",1128.05,{"$f":"G75 * 1.23","v":1387.5014999999999},null,null,null,null,null,null,null,null,null,null,null,null,null,null,null,{"$f":"(SUM(I75:W75))","v":0},1850,{"$f":"AA75 / 1.23","v":1128.05},{"$f":"H75 * (1-WS_DISCOUNT)","v":1387.5014999999999},{"$f":"((SUM(I75:W75)) * AA75)","v":0},null,null,null,null,null,"#ART","#MATKZ",null,null,null,null,"#DIM-YVBK128","#DIM-YVBK140","#DIM-YVBK152","#DIM-YVBK164","#DIM-YVBK176",null,null,null,null,null,null,null,null,null,null,"#POSMENGE",null,"#PREIS-1128.05",null,"#POSWERT","#BEMERKUNG"]
[null,"N:59.1|59",826032,null,"RACE SOFTSHELL Jacket Junior","BK",493.9,607.49699999999996,null,null,null,null,null,null,null,null,null,null,null,null,null,null,null,0,810,493.9,607.49699999999996,0,null,null,null,null,null,"#ART","#MATKZ",null,null,null,null,"#DIM-BK  128","#DIM-BK  140","#DIM-BK  152","#DIM-BK  164","#DIM-BK  176",null,null,null,null,null,null,null,null,null,null,"#POSMENGE",null,"#PREIS-493.9",null,"#POSWERT","#BEMERKUNG"]
[null,"N:59.1|59",826524,null,"RACE Shorts Junior","BK",390.24,479.99520000000001,null,null,null,null,null,null,null,null,null,null,null,null,null,null,null,0,640,390.24,479.99520000000001,0,null,null,null,null,null,"#ART","#MATKZ",null,null,null,null,"#DIM-BK  128","#DIM-BK  140","#DIM-BK  152","#DIM-BK  164","#DIM-BK  176",null,null,null,null,null,null,null,null,null,null,"#POSMENGE",null,"#PREIS-390.24",null,"#POSWERT","#BEMERKUNG"]
[null,"N:59.1|59",826514,null,"RACE Rain Coat Junior","BK",560.98,690.00540000000001,null,null,null,null,null,null,null,null,null,null,null,null,null,null,null,0,920,560.98,690.00540000000001,0,null,null,null,null,null,"#ART","#MATKZ",null,null,null,null,"#DIM-BK  128","#DIM-BK  140","#DIM-BK  152","#DIM-BK  164","#DIM-BK  176",null,null,null,null,null,null,null,null,null,null,"#POSMENGE",null,"#PREIS-560.98",null,"#POSWERT","#BEMERKUNG"]
[null,"N:59.1|59",826514,null,"RACE Rain Coat Junior","BL",560.98,690.00540000000001,null,null,null,null,null,null,null,null,null,null,null,null,null,null,null,0,920,560.98,690.00540000000001,0,null,null,null,null,null,"#ART","#MATKZ",null,null,null,null,"#DIM-BL  128","#DIM-BL  140","#DIM-BL  152","#DIM-BL  164","#DIM-BL  176",null,null,null,null,null,null,null,null,null,null,"#POSMENGE",null,"#PREIS-560.98",null,"#POSWERT","#BEMERKUNG"]
[null,"N:59.1|59",826042,null,"RACE KINETIC Jacket Junior","BK",530.49,652.5027,null,null,null,null,null,null,null,null,null,null,null,null,null,null,null,0,870,530.49,652.5027,0,null,null,null,null,null,"#ART","#MATKZ",null,null,null,null,"#DIM-BK  128","#DIM-BK  140","#DIM-BK  152","#DIM-BK  164","#DIM-BK  176",null,null,null,null,null,null,null,null,null,null,"#POSMENGE",null,"#PREIS-530.49",null,"#POSWERT","#BEMERKUNG"]
[null,"N:59.1|59",826042,null,"RACE KINETIC Jacket Junior","BLWH",530.49,652.5027,null,null,null,null,null,null,null,null,null,null,null,null,null,null,null,0,870,530.49,652.5027,0,null,null,null,null,null,"#ART","#MATKZ",null,null,null,null,"#DIM-BLWH128","#DIM-BLWH140","#DIM-BLWH152","#DIM-BLWH164","#DIM-BLWH176",null,null,null,null,null,null,null,null,null,null,"#POSMENGE",null,"#PREIS-530.49",null,"#POSWERT","#BEMERKUNG"]
[null,"N:59.1|59",826554,null,"RACE Hoodie Junior","BK",195.12,239.99760000000001,null,null,null,null,null,null,null,null,null,null,null,null,null,null,null,0,320,195.12,239.99760000000001,0,null,null,null,null,null,"#ART","#MATKZ",null,null,null,null,"#DIM-BK  128","#DIM-BK  140","#DIM-BK  152","#DIM-BK  164","#DIM-BK  176",null,null,null,null,null,null,null,null,null,null,"#POSMENGE",null,"#PREIS-195.12",null,"#POSWERT","#BEMERKUNG"]
[null,"N:59.1|59",826554,null,"RACE Hoodie Junior","BL",195.12,239.99760000000001,null,null,null,null,null,null,null,null,null,null,null,null,null,null,null,0,320,195.12,239.99760000000001,0,null,null,null,null,null,"#ART","#MATKZ",null,null,null,null,"#DIM-BL  128","#DIM-BL  140","#DIM-BL  152","#DIM-BL  164","#DIM-BL  176",null,null,null,null,null,null,null,null,null,null,"#POSMENGE",null,"#PREIS-195.12",null,"#POSWERT","#BEMERKUNG"]
[null,"N:59.1|59",826554,null,"RACE Hoodie Junior","WH",195.12,239.99760000000001,null,null,null,null,null,null,null,null,null,null,null,null,null,null,null,0,320,195.12,239.99760000000001,0,null,null,null,null,null,"#ART","#MATKZ",null,null,null,null,"#DIM-WH  128","#DIM-WH  140","#DIM-WH  152","#DIM-WH  164","#DIM-WH  176",null,null,null,null,null,null,null,null,null,null,"#POSMENGE",null,"#PREIS-195.12",null,"#POSWERT","#BEMERKUNG"]

{"sheet":"Definition","index":8,"n_rows":164,"n_cols":13,"rows_kept":164,"cut":false,"hidden":true,"merged":[]}
[null,"#TEMPLATE"]
["Order Form Definition"]
[null,"Development Mode ",null,null,null,"Productive Mode"]
[]
["Fields for Data Transfer:",null,null,null,null,"Header Fields:",null,null,"Content Fields:"]
[null,null,null,null,null,null,"Color (Width)"]
["Material Number",230036,null,null,null,"Material Number",9,null,"Material Number",230036]
[]
["QTTY Field (Dimension)","S10",null,null,null,"QTTY Field (Dimension)",4,null,"Active QTTY Field (Dimension)","S10",null,"Inactive QTTY Field (Dimension)"]
[]
["Price Field",123,null,null,null,"Price Field",8,null,"Price Field",123]
[]
["Item-QTTY",123,null,null,null,"Material Description",40,null,"Material Description","Test",null,"Material Descr. *** no binding ***","Test"]
[]
["Item-Amount",123,null,null,null,"Price 1",8,null,"Price 1",123]
[]
["Delivery Date Quantity",123,null,null,null,"Price 2",8,null,"Price 2",123]
[]
["Delivery Date Amount",123,null,null,null,"Vertical Grid",10,null,"Vertical Grid","Test"]
[]
[null,null,null,null,null,"Item-QTTY",8,null,"Item-QTTY",123]
[]
[null,null,null,null,null,"Item-Amount",11,null,"Item-Amount",123.45]
[]
[null,null,null,null,null,"Delivery Date Quantity",8,null,"Delivery Date Quantity",123]
[]
[null,null,null,null,null,"Delivery Date Amount",11,null,"Delivery Date Amount",123.45]
[]
["Material-KZ","Test",null,null,null,"Material-KZ",3,null,"Material-KZ","Test"]
[]
[null,null,null,null,null,"Attribute short",8,null,"Attribute short","Test"]
[]
[null,null,null,null,null,"Attribute long",20,null,"Attribute long","Test"]
[]
[null,null,null,null,null,"Attribute 4",4,null,"Attribute 4","Test"]
[]
[null,null,null,null,null,"Netscale on Item level",8,null,"Netscale on Item level","Test"]
[]
[null,null,null,null,null,"Discount on Item Level",6,null,"Discount on Item Level",0.01]
[]
["NetScale / Nettostaffel",123,null,null,null,null,null,null,"NetScale / Nettostaffel",1]
[]
["Unit of Measure","Test",null,null,null,"Unit of Measure",5,null,"Unit of Measure","Test"]
[]
["Price Indicator","Test",null,null,null,"Price Indicator",3,null,"Price Indicator","Test"]
[]
["Remarks","Test",null,null,null,"Remarks",20,null,"Remarks","Test"]
[]
["Common input field","Test",null,null,null,"Common input field",8,null,"Common input field","Test"]
[]
[]
[null,null,null,null,null,"Special Format Definions:"]
[]
[null,null,null,null,null,"Group Header","Test","Test","Test"]
[]
[null,null,null,null,null,"Text-Line","Test"]
[]
[null,null,null,null,null,"Left Border Line for first column of each Delivery Date"]
[]
[null,null,null,null,null,"Ausgeblendete Spalte",0]
[]
[null,null,null,null,null,"Summen-Menge",123.45,null,"(Farbe ist nicht relevant)"]
[]
[null,null,null,null,null,"Summen-Wert",123.45,null,"(Farbe ist nicht relevant)"]
[]
["Globale Parameters (Names):"]
[]
["# of Admin-Spalten:",2]
["First DelDate Row:",10]
["# of Delivery Dates",1]
["# of Summary DelDates",1]
["Checkbox Delivery Date 1 - Visible",null,"\"X\"=Yes / \" \" = No"]
["Checkbox Delivery Date 2 - Visible",null,"\"X\"=Yes / \" \" = No"]
["Checkbox Delivery Date 3 - Visible",null,"\"X\"=Yes / \" \" = No"]
["Checkbox Delivery Date 4 - Visible",null,"\"X\"=Yes / \" \" = No"]
["Checkbox DeliveryvDate Totals - Visible",null,"\"X\"=Yes / \" \" = No"]
["Checkbox Delivery Date Totals - Default","X","\"X\"=Checked / \" \"=Unchecked"]
["Worksheet Discount/NetScale Name:","Zniżka","For product line header on summary sheet"]
["Worksheet NetScale (Nettostaffel):",null,"\"X\"=Yes / \" \" = No"]
["Worksheet Discount:","X","\"X\"=Yes / \" \" = No"]
["Remove hidden sheets from Summary:","X","\"X\"=Yes / \" \" = No",null,null,"Dialog text:","Remove hidden sheets from Summary (if empty)"]
["Password for Sheet Administration",null,"(optional)"]
["Hide repeated article no and description","X","\"X\"=Yes / \" \" = No"]
[]
["Checkbox Delivery Empty Lines - Linked Cell","$B$4","These definitions are required because the linked cell cannot be determied on MacOS"]
["Checkbox Delivery Date Total - Linked Cell","$B$5"]
["Checkbox Delivery Date 1 - Linked Cell","$B$6"]
["Checkbox Delivery Date 2 - Linked Cell","$B$7"]
["Checkbox Delivery Date 3 - Linked Cell","$B$8"]
["Checkbox Delivery Date 4 - Linked Cell","$B$9"]
[]
["Material-Number Column",3]
["Material-KZ Column",4]
["Material-Text Column",5]
[]
["Additional text for sheet title","-kod prod. to link do zdjęcia!"]
["Text - Switch to DEV Message","Switch to DEV-Mode?     All quantity input data will be deleted!!!"]
["Text - Context Menu - Copy Article Line","Copy Artikel Line"]
["Text - Context Menu - Column Width","Column Width"]
[]
["Header CustomerAddress Selection","Customer address selection"]
["Header Delivery Address Selection","Delivery address selection"]
["Header Invoice Address Selection","Invoice address selection"]
["Header Sales-Rep Address Selection","Sales-rep. address selection"]
[]
["Delivery Date 1 - ID"]
["Delivery Date 2 - ID"]
["Delivery Date 3 - ID"]
["Delivery Date 4 - ID"]
["Delivery Date 5 - ID"]
["Delivery Date 6 - ID"]
[]
["Pricelist filename (filled during creation)"]
["No Summary Update",null,"\"X\"=Yes / \" \" = No"]
["WS_Netscale Listbox füllen",null,"\"X\"=Yes / \" \" = No"]
[]
["SAP Parameters (Names):"]
["SAP-Applikations-Server","62.184.167.132|62.184.167.132|62.184.167.134"]
["SAP-System ID","DEV … Development-System|TST … Test-System|*PRD … Productive-System",null,null,null,null,null,null,"* … Marker for Default System"]
["SAP-System No","10|01|10"]
["SAP-Client","021"]
["SAP-User",null,"(optional)"]
["SAP-Language","EN"]
["Order Import Queue (max. 15 digits)","PL-ORDERS"]
["Message für missing Key","Please enter CUSTOMER-NO., ORDER-NO. and ORDER DATE first"]
[]
["Important Information:"]
[]
["If cells are linked to checkboxes, these cells may not be locked, otherwise an error message appears if the checkbox state is changed."]
[]
[]
["List Definitions:","Field","Default \nLock \nStatus","Description for unlock dialog"]
["#LOCK","F_SALES_REP","X","Sales Rep:"]
["#LOCK","CB_SALESREP","X","Button Sales Rep selection:"]
["#LOCK","F_CUST_NO","X","Customer no:"]
["#LOCK","F_CUST_NAME",null,"Customer name:"]
["#LOCK","F_CUST_ADDR",null,"Customer addr:"]
["#LOCK","CB_CUSTOMER","X","Button Customer selection:"]
["#LOCK","F_DELIV_ADDR_NO",null,"Delivery address no:"]
["#LOCK","F_DELIV_NAME",null,"Delivery name:"]
["#LOCK","F_DELIV_ADDR",null,"Delivery address:"]
["#LOCK","CB_DELIV_ADDR","X","Button Delivery address selection:"]
["#LOCK","CB_CUST_PREPARE","X","Prepare for Customer:"]
["#LOCK","WS_NETPRICE","X","Netprice fields on data sheets"]
["#LOCK","WS_INPUT","X","SET-Netprice fields on data sheets"]
["#LOCK","WS_DISCOUNT","X","Discount on data sheets"]
[]
["#REQ-PREP-CUST","F_SALES_REP","Please enter \"Sales Rep first\""]
["#REQ-PREP-CUST","F_CUST_NO","Please enter \"Customer No\""]
["#REQ-PREP-CUST","F_EMAIL_REP","Please enter \"Sales Rep Email\" first"]
["#REQ-PREP-CUST","F_ORDER_REASON","Please select \"Order Reason and Customer Grp\" first"]
["#REQ-PREP-CUST","F_CUST_GROUP","Please select \"Order Reason and Customer Grp\" first"]
[]
["#SALES-REP-MODE","F_DELIV_ADDR_NO",null,"Delivery address no:"]
["#SALES-REP-MODE","F_CUST_NO","X","Customer no:"]
["#SALES-REP-MODE","F_CUST_NAME","X","Customer name:"]
["#SALES-REP-MODE","F_CUST_ADDR","X","Customer addr:"]
["#SALES-REP-MODE","CB_CUSTOMER","X","Button Customer selection:"]
["#SALES-REP-MODE","F_DELIV_NAME",null,"Delivery name:"]
["#SALES-REP-MODE","F_DELIV_ADDR",null,"Delivery address:"]
["#SALES-REP-MODE","CB_DELIV_ADDR",null,"Button Delivery address selection:"]
["#SALES-REP-MODE","CB_CUST_PREPARE","X","Prepare for Customer:"]
["#SALES-REP-MODE","WS_NETPRICE","X","Netprice Fields on data sheets"]
["#SALES-REP-MODE","WS_DISCOUNT","X","Discount on data sheets"]

{"sheet":"PriceTable","index":9,"n_rows":1,"n_cols":4,"rows_kept":1,"cut":false,"hidden":true,"merged":[]}
["Matnr","MatKZ","V-Grid","Price-Basis"]

{"sheet":"Template","index":10,"n_rows":15,"n_cols":20,"rows_kept":15,"cut":false,"hidden":true,"merged":[[9,5,9,17],[4,8,4,14],[2,3,2,5],[2,6,2,7],[2,8,2,14],[3,3,3,5],[2,15,2,18],[3,15,3,18],[4,15,4,18],[6,3,6,5],[6,8,6,14],[5,6,5,7],[5,8,5,14],[3,6,3,7],[3,8,3,14],[4,3,5,5],[4,6,4,7],[5,15,5,18],[6,15,6,18],[2,19,2,22],[3,19,3,22],[4,19,4,22],[5,19,5,22],[6,19,6,22]]}
["#DEV","#TEMPLATE"]
[{"$f":"SUM(A10:A12)","v":0},{"$f":"SUM(B10:B12)","v":0},"   ",null,"   "]
["B3 has to be empty!!!",null,"Nr klienta",{"$f":"IF(F_CUST_NO=\"\",\"\",F_CUST_NO)","v":"NEW"},null,null,"Nr zamówienia",null,{"$f":"IF(F_ORDER_NO=\"\",\"\",F_ORDER_NO)","v":"PRE RACE 24/25"},null,null,null,null,null,null,"Data zamówienia",null,null,null,{"$f":"IF(F_ORDER_DATE<> \"\",F_ORDER_DATE,\"\")","v":""}]
["Empty Lines:",true,"Nazwa firmy",{"$f":"IF(F_CUST_NAME=\"\",\"\",F_CUST_NAME)","v":""},null,null,"Sales Rep.",null,{"$f":"IF(F_SALES_REP=\"\",\"\",F_SALES_REP)","v":"2694000|Sales Rep / Poland"},null,null,null,null,null,null,"Data dostawy",null,null,null,{"$f":"IF(F_DELDATE1<> \"\",F_DELDATE1,\"\")","v":""}]
["Delivery Date Total:",true,"Adres",{"$f":"IF(F_CUST_ADDR=\"\",\"\",F_CUST_ADDR)","v":""},null,null,null,null,null,null,null,null,null,null,null,null,null,null,null,{"$f":"IF(F_DELDATE2<> \"\",F_DELDATE2,\"\")","v":""}]
["Delivery Date 1:",true,"   ",null,null,null,"Zniżka",null,null,null,null,null,null,null,null,null,null,null,null,{"$f":"IF(F_DELDATE3<> \"\",F_DELDATE3,\"\")","v":""}]
["Delivery Date 2:",true]
["Delivery Date 3:",true]
[null,null,"HEAD Sport GmbH - Wuhrkopfweg 1 "]
["Reserved DD1-QTTY","DD1-Amount","Wuhrkopfweg 1 - A 6921 Kennelbach Austria",null,null,{"$f":"_xlnm.Sheet_Title()","v":{"$error":"#NAME?"}}]
["Reserved DD2-QTTY","DD2-Amount","FN 64824 f"]
["Reserved DD3-QTTY","DD3-Amount"]
["Reserved DD4-QTTY","DD4-Amount"]
["Reserved DD5-QTTY","DD5-Amount"]
["Reserved DD6-QTTY","DD6-Amount"]

{"sheet":"ColorTable","index":11,"n_rows":12,"n_cols":3,"rows_kept":12,"cut":false,"hidden":true,"merged":[]}
[null,"#TEMPLATE"]
["Sample","FG-Color","BG-Color"]
["Test",16777215,255]
["Test",16777215,16711680]
["Test",16777215,16763904]
["Test",16777215,65280]
["Test",16777215,16711935]
["Test",0,65535]
["Test",0,39423]
["Test",0,12632256]
["Test",16777215,0]
["Test",16777215,32768]

{"sheet":"AddressList","index":12,"n_rows":2469,"n_cols":12,"rows_kept":2469,"cut":false,"hidden":true,"merged":[]}
["Address No","Partner Type","Partner No","xxxxxxxxx","xxxxxxxxx","SalesRep","EMail","Telnr","UIDNR","Add-Data","Has-ShipTo","AG-Is-ShipTo"]
[26010597,"AG",null,"xxxxxxxxx","xxxxxxxxx","2694000,2694016,","marcin@tandt.pl","602 559 201","PL8981394651",null,"X","X"]
[26011321,"AG",null,"xxxxxxxxx","xxxxxxxxx","2694000,2694025,","jacek.tyczy@gmail.com","604 077 851",null,null,null,"X"]
[26010854,"AG",null,"xxxxxxxxx","xxxxxxxxx","2694000,2694025,","andrzej.chowaniec@interia.eu","664 082 207","PL7341063873",null,null,"X"]
[26010366,"AG",null,"xxxxxxxxx","xxxxxxxxx","2694000,2694016,","kw@mpla.info","601 788 811","PL8970004474",null,null,"X"]
[26011834,"AG",null,"xxxxxxxxx","xxxxxxxxx","2694000,2694016,","magdapl4@op.pl",695231410,"PL9161286928",null,null,"X"]
[26010678,"AG",null,"xxxxxxxxx","xxxxxxxxx","2694000,2694025,","allegro@time4tennis.pl","32 337 16 60","PL6310105110",null,null,"X"]
[26010697,"AG",null,"xxxxxxxxx","xxxxxxxxx","2694000,2694025,","kkarolina128@gmail.com","514 843 168","PL5482219690",null,null,"X"]
[26010418,"AG",null,"xxxxxxxxx","xxxxxxxxx","2694000,2694025,","sportissimo.konin@gmail.com",500285303,"PL6652991072",null,null,"X"]
[26010496,"AG",null,"xxxxxxxxx","xxxxxxxxx","2694000,2694025,","mandf@interia.pl",null,"PL8792537380",null,null,"X"]
[26011122,"AG",null,"xxxxxxxxx","xxxxxxxxx","2694000,2694025,","strefasporturzeszow@gmail.com",null,"PL8130335163",null,null,"X"]
[26010763,"AG",null,"xxxxxxxxx","xxxxxxxxx","2694000,2694025,","raszka976@gmail.com",502470710,null,null,"X","X"]
[26010028,"AG",null,"xxxxxxxxx","xxxxxxxxx","2694000,2694016,","bednarek.sport@gmail.com","502 045 508","PL6270000332",null,"X","X"]
[26011952,"AG",null,"xxxxxxxxx","xxxxxxxxx","2694000,2694016,","mateusz@2bsport.pl","507 701 313","PL6342752315",null,null,"X"]
[26011541,"AG",null,"xxxxxxxxx","xxxxxxxxx","2694000,2694016,","serwis@2ski.pl",605655119,null,null,null,"X"]
[26010453,"AG",null,"xxxxxxxxx","xxxxxxxxx","2694000,2694025,","tomek.2hills@gmail.com","600 402 903",null,null,null,"X"]
[26011903,"AG",null,"xxxxxxxxx","xxxxxxxxx","2694000,2694025,","marcin@4tenn.com","505 446 077",null,null,null,"X"]
[26010702,"AG",null,"xxxxxxxxx","xxxxxxxxx","2694000,2694025,","adam@tenisklub.pl","600 999 991","PL9512156862",null,"X","X"]
[26011121,"AG",null,"xxxxxxxxx","xxxxxxxxx","2694000,2694025,","sklep@4wsport.pl","575 300 059",null,null,null,"X"]
[26011697,"AG",null,"xxxxxxxxx","xxxxxxxxx","2694000,2694025,","walekajacek@wp.pl","500 030 845",null,null,null,"X"]
[26010234,"AG",null,"xxxxxxxxx","xxxxxxxxx","2694000,2694025,","czile@interia.pl",603682562,null,null,"X","X"]
[26012116,"AG",null,"xxxxxxxxx","xxxxxxxxx","2694000,2694017,","beniamin@abactive.pl",608400414,"PL9512579290",null,null,"X"]
[26011355,"AG",null,"xxxxxxxxx","xxxxxxxxx","2694000,2694016,","barto@bsn.com.pl","690 083 003",null,null,null,"X"]
[26010861,"AG",null,"xxxxxxxxx","xxxxxxxxx","2694000,2694017,","info@abcsurf.pl",501550002,"PL5832775174",null,"X","X"]
[26011841,"AG",null,"xxxxxxxxx","xxxxxxxxx","2694000,2694016,","wplaski@o2.pl",695551508,null,null,null,"X"]
[26011203,"AG",null,"xxxxxxxxx","xxxxxxxxx","2694000,2694025,","dariusz.baldys@action.pl","509 877 484","PL5271107221",null,null,"X"]
[26011807,"AG",null,"xxxxxxxxx","xxxxxxxxx","2694000,2694016,","acsportlab@gmail.com","664 141 389","PL5482730402",null,null,"X"]
[26010189,"AG",null,"xxxxxxxxx","xxxxxxxxx","2694000,2694016,","info@familisport.pl",618757875,"PL7830007650",null,"X","X"]
[26010795,"AG",null,"xxxxxxxxx","xxxxxxxxx","2694000,2694017,","jaroslaw.lach@aida-bialystok.pl","606 200051","PL5420303477",null,null,"X"]
[26010811,"AG",null,"xxxxxxxxx","xxxxxxxxx","2694000,2694016,","monika@akademiapodrozy.pl",693255005,"PL7422039459",null,null,"X"]
[26011562,"AG",null,"xxxxxxxxx","xxxxxxxxx","2694000,2694025,","piotrek264@wp.pl","508 139 320",null,null,null,"X"]
[26010714,"AG",null,"xxxxxxxxx","xxxxxxxxx","2694000,2694016,","warszawa@azs.pl","22 827 28 63",null,null,null,"X"]
[26012114,"AG",null,"xxxxxxxxx","xxxxxxxxx","2694000,2694025,","olek.traczyk@gmail.com",511291909,"PL8262209461",null,null,"X"]
[26010210,"AG",null,"xxxxxxxxx","xxxxxxxxx","2694000,2694025,","marciniak@allforyou.pl",509050114,"PL7831604833",null,null,"X"]
[26010438,"AG",null,"xxxxxxxxx","xxxxxxxxx","2694000,2694025,","maciej.pietraszewski@wp.pl","601 839 339",null,null,null,"X"]
[26011266,"AG",null,"xxxxxxxxx","xxxxxxxxx","2694000,2694025,","alltyres@op.pl","519-801-084","PL5661412104",null,null,"X"]
[26010844,"AG",null,"xxxxxxxxx","xxxxxxxxx","2694000,2694017,","altsport@altsport.pl","609-733-899","PL5321345099",null,"X","X"]
[26010776,"AG",null,"xxxxxxxxx","xxxxxxxxx","2694000,2694017,","joanna@amazing.pl","607 041 741","PL5322053105",null,"X","X"]
[26010397,"AG",null,"xxxxxxxxx","xxxxxxxxx","2694000,2694017,","olzo@interia.pl","601-449-407","PL6762469388",null,null,"X"]
[26010300,"AG",null,"xxxxxxxxx","xxxxxxxxx","2694000,2694017,","maciejcukier.ivbv@gmail.com",601150881,"PL7361022995",null,null,"X"]
[26010634,"AG",null,"xxxxxxxxx","xxxxxxxxx","2694000,2694025,","kontakt@magicsports.pl","48 694 107 073","PL6292143027",null,null,"X"]
[26010554,"AG",null,"xxxxxxxxx","xxxxxxxxx","2694000,2694016,","paweltg5@gmail.com","792 281 549","PL7342542386",null,null,"X"]
[26011993,"AG",null,"xxxxxxxxx","xxxxxxxxx","2694000,2694016,","frente68@op.pl",504102979,"PL5482657303",null,"X","X"]
[26010858,"AG",null,"xxxxxxxxx","xxxxxxxxx","2694000,2694016,","aniakempys@gmail.com","697 593 483","PL7361592853",null,null,"X"]
[26011732,"AG",null,"xxxxxxxxx","xxxxxxxxx","2694000,2694050,","phelinski@khelinska.com.pl","602 70 78 79",null,null,null,"X"]
[26011076,"AG",null,"xxxxxxxxx","xxxxxxxxx","2694000,2694025,","darek@preisler.pl","661 487 485",null,null,"X","X"]
[26010021,"AG",null,"xxxxxxxxx","xxxxxxxxx","2694000,2694017,","g.betlej@vp.pl",602737012,"PL8721949738",null,null,"X"]
[26011992,"AG",null,"xxxxxxxxx","xxxxxxxxx","2694000,2694016,","biuro@strefazimy.pl","693 429 329","PL9372392857",null,null,"X"]
[26011123,"AG",null,"xxxxxxxxx","xxxxxxxxx","2694000,2694015,","otruszkowska@astrapolska.pl","+48 609 987 737","PL1070005693",null,null,"X"]
[26011522,"AG",null,"xxxxxxxxx","xxxxxxxxx","2694000,2694016,","biuro.atacama@gmail.com","695 730 835","PL8942713543",null,null,"X"]
[26010306,"AG",null,"xxxxxxxxx","xxxxxxxxx","2694000,2694025,","biuro@atppro.pl",692424470,"PL7321842344",null,"X","X"]
[26010876,"AG",null,"xxxxxxxxx","xxxxxxxxx","2694000,2694025,","agnieszka.wajdemajer@gmail.com","501 615 244","PL1231039899",null,"X","X"]
[26011406,"AG",null,"xxxxxxxxx","xxxxxxxxx","2694000,2694017,","krzysztof.plewa@atklub.pl","660 411 532",null,null,null,"X"]
[26010701,"AG",null,"xxxxxxxxx","xxxxxxxxx","2694000,2694025,","j.pszowska@gmail.com",604561430,"PL7561754378",null,null,"X"]
[26011556,"AG",null,"xxxxxxxxx","xxxxxxxxx","2694000,2694017,","sklep@nartyrowerykrakow.pl",693352237,"PL6832096924",null,"X","X"]
[26010043,"AG",null,"xxxxxxxxx","xxxxxxxxx","2694000,2694016,","zaczyk@me.com",502288301,"PL8831604259",null,null,"X"]
[26011597,"AG",null,"xxxxxxxxx","xxxxxxxxx","2694000,2694016,","azs@awf.katowice.pl","(32) 207 52 81","PL6341013320",null,null,"X"]
[26011172,"AG",null,"xxxxxxxxx","xxxxxxxxx","2694000,2694025,","tomekiwanski@yahoo.com","601 177703",null,null,null,"X"]
[26010791,"AG",null,"xxxxxxxxx","xxxxxxxxx","2694000,2694025,","firma@activ-sport.krakow.pl","601 471 814",null,null,null,"X"]
[26011907,"AG",null,"xxxxxxxxx","xxxxxxxxx","2694000,2694025,","maciej.piecha@onet.pl",609264479,null,null,null,"X"]
[26012102,"AG",null,"xxxxxxxxx","xxxxxxxxx","2694000,2694016,","dom@activetherapy.eu",794385081,"PL8862519945",null,null,"X"]
[26011513,"AG",null,"xxxxxxxxx","xxxxxxxxx","2694000,2694017,","active@woj-tom.pl",697006001,"PL7343543465",null,null,"X"]
[26012026,"AG",null,"xxxxxxxxx","xxxxxxxxx","2694000,2694016,","kontakt@activetime24.com","784 648 086",null,null,"X","X"]
[26010928,"AG",null,"xxxxxxxxx","xxxxxxxxx","2694000,2694025,","grabinski.ad@gmail.com",792022323,null,null,null,"X"]
[26010646,"AG",null,"xxxxxxxxx","xxxxxxxxx","2694000,2694050,","Olgierd.Kwiatkowski69@gmail.com","602 795 882",null,null,null,"X"]
[26011735,"AG",null,"xxxxxxxxx","xxxxxxxxx","2694000,2694025,","adampajestka@tlen.pl","509 685 880",null,null,null,"X"]
[26010632,"AG",null,"xxxxxxxxx","xxxxxxxxx","2694000,2694016,","adventureelement@gmail.com","506-163-155",null,null,null,"X"]
[26011544,"AG",null,"xxxxxxxxx","xxxxxxxxx","2694000,2694050,","gusia_2211@op.pl","502 117 892",null,null,null,"X"]
[26010474,"AG",null,"xxxxxxxxx","xxxxxxxxx","2694000,2694050,","aga@bono.pl","663 171 640","PL8520604895",null,null,"X"]
[26010463,"AG",null,"xxxxxxxxx","xxxxxxxxx","2694000,2694016,","info@dendysski.pl",791111047,null,null,null,"X"]
[26011059,"AG",null,"xxxxxxxxx","xxxxxxxxx","2694000,2694025,","agnieszkarusin@o2.pl","608 323 290",null,null,null,"X"]
[26012094,"AG",null,"xxxxxxxxx","xxxxxxxxx","2694000,2694017,","kochancz@agh.edu.pl","885 984 130","PL6750001923",null,"X","X"]
[26010758,"AG",null,"xxxxxxxxx","xxxxxxxxx","2694000,2694017,","asibil@poczta.onet.pl",605337173,null,null,null,"X"]
[26011333,"AG",null,"xxxxxxxxx","xxxxxxxxx","2694000,2694025,","akademiatenisamm@gmail.com","603 846 856","PL5922170316",null,"X","X"]
[26010439,"AG",null,"xxxxxxxxx","xxxxxxxxx","2694000,2694025,","andmike@Interia.pl","608 108146",null,null,null,"X"]
[26010489,"AG",null,"xxxxxxxxx","xxxxxxxxx","2694000,2694025,","raszka976@gmail.com","502 470 710",null,null,"X","X"]
[26010123,"AG",null,"xxxxxxxxx","xxxxxxxxx","2694000,2694025,","dareks32@wp.pl",603111442,null,null,null,"X"]
[26010942,"AG",null,"xxxxxxxxx","xxxxxxxxx","2694000,2694025,","lukasz.sek@onet.pl",506694877,null,null,null,"X"]
[26010887,"AG",null,"xxxxxxxxx","xxxxxxxxx","2694000,2694025,","tomasz.poplonski@awf.krakow.pl",null,"PL6750001952",null,null,"X"]
[26010284,"AG",null,"xxxxxxxxx","xxxxxxxxx","2694000,2694016,","asnakademicka@gmail.com",502327009,null,null,null,"X"]
[26011548,"AG",null,"xxxxxxxxx","xxxxxxxxx","2694000,2694016,","info@podroze4x4.pl","607 955 607","PL7381885512",null,"X","X"]
[26011971,"AG",null,"xxxxxxxxx","xxxxxxxxx","2694000,2694016,","sklep@xtreme-shop.pl","531 390 887","PL6412544356",null,"X","X"]
[26011033,"AG",null,"xxxxxxxxx","xxxxxxxxx","2694000,2694017,","wiertnicza@aktiv-sport.pl","22  842 06 40","PL5213165897",null,"X","X"]
[26011916,"AG",null,"xxxxxxxxx","xxxxxxxxx","2694000,2694025,","alan-matelski@wp.pl","604 210 434",null,null,null,"X"]
[26010322,"AG",null,"xxxxxxxxx","xxxxxxxxx","2694000,2694016,","alicja@alda-sport.pl",664062460,null,null,null,"X"]
[26011592,"AG",null,"xxxxxxxxx","xxxxxxxxx","2694000,2694025,","alik.kaczmarek@gmail.com",504102284,null,null,null,"X"]
[26011402,"AG",null,"xxxxxxxxx","xxxxxxxxx","2694000,2694050,2694025,","Korzen88@o2.pl","501 537 006",null,null,null,"X"]
[26011206,"AG",null,"xxxxxxxxx","xxxxxxxxx","2694000,2694050,","sadal.olo@wp.pl",602188080,null,null,null,"X"]
[26011227,"AG",null,"xxxxxxxxx","xxxxxxxxx","2694000,2694025,","aleksander.trojanowicz@outlook.com","695 101 110",null,null,null,"X"]
[26011648,"AG",null,"xxxxxxxxx","xxxxxxxxx","2694000,2694050,","aleksandrakocot10@gmail.com","789 372 160",null,null,null,"X"]
[26011161,"AG",null,"xxxxxxxxx","xxxxxxxxx","2694000,2694017,","ola.majerczyk30@gmail.com",782973872,null,null,null,"X"]
[26012032,"AG",null,"xxxxxxxxx","xxxxxxxxx","2694000,2694025,","srokakaro@gmail.com","509 788 796","PL5130199215",null,null,"X"]
[26011545,"AG",null,"xxxxxxxxx","xxxxxxxxx","2694000,2694025,","alexander.sano@gmail.com",608031150,null,null,null,"X"]
[26010490,"AG",null,"xxxxxxxxx","xxxxxxxxx","2694000,2694025,","aledocarsan@yahoo.com",517509422,null,null,null,"X"]
[26010662,"AG",null,"xxxxxxxxx","xxxxxxxxx","2694000,2694025,","a.slipczynska@gmail.com","509 034 829",null,null,null,"X"]
[26011330,"AG",null,"xxxxxxxxx","xxxxxxxxx","2694000,2694025,","przemek@marinajastarnia.pl","796 757 818","PL5252553988",null,null,"X"]
[26011387,"AG",null,"xxxxxxxxx","xxxxxxxxx","2694000,2694017,","mariusz@amazingtravel.pl",503668183,null,null,null,"X"]
[26010587,"AG",null,"xxxxxxxxx","xxxxxxxxx","2694000,2694016,","robert.metryka@wp.pl","662 252 053","PL9590556363",null,"X","X"]
[26010455,"AG",null,"xxxxxxxxx","xxxxxxxxx","2694000,2694025,","andrzej.chowaniec@interia.eu","664 082 207",null,null,null,"X"]
[26011057,"AG",null,"xxxxxxxxx","xxxxxxxxx","2694000,2694025,","ahuczko@chem.uw.edu.pl",508221506,null,null,null,"X"]
[26011859,"AG",null,"xxxxxxxxx","xxxxxxxxx","2694000,2694016,","andrzej-romanski@wp.pl","793 763 753","PL7341205669",null,"X","X"]
[26010991,"AG",null,"xxxxxxxxx","xxxxxxxxx","2694000,2694025,","astra22@onet.eu","502 841 882",null,null,"X","X"]
[26010778,"AG",null,"xxxxxxxxx","xxxxxxxxx","2694000,2694016,","anna.szymanska1@pl.ibm.com",null,null,null,null,"X"]
[26010561,"AG",null,"xxxxxxxxx","xxxxxxxxx","2694000,2694017,","biuro@ange.pl",603177260,null,null,null,"X"]
[26011570,"AG",null,"xxxxxxxxx","xxxxxxxxx","2694000,2694017,","przemyslaw@himalayasport.pl","796 216 416","PL6792505404",null,null,"X"]
[26011054,"AG",null,"xxxxxxxxx","xxxxxxxxx","2694000,2694050,","tbraniecki@wp.pl","513 001 810",null,null,null,"X"]
[26010542,"AG",null,"xxxxxxxxx","xxxxxxxxx","2694000,2694025,","anetasitarz@gmail.com","660 978 909",null,null,"X","X"]
[26011186,"AG",null,"xxxxxxxxx","xxxxxxxxx","2694000,2694017,","aneta.szkola@dssmith.com",696898530,null,null,null,"X"]
[26011171,"AG",null,"xxxxxxxxx","xxxxxxxxx","2694000,2694016,","biuro@funrace.pl","501 724 216",null,null,null,"X"]
[26011530,"AG",null,"xxxxxxxxx","xxxxxxxxx","2694000,2694016,","ahilles@hotmail.com","604-952-967",null,null,null,"X"]
[26010579,"AG",null,"xxxxxxxxx","xxxxxxxxx","2694000,2694015,","Anna.Maslyk@intersport.pl",600872659,null,null,null,"X"]
[26010759,"AG",null,"xxxxxxxxx","xxxxxxxxx","2694000,2694025,","annapowaska@gmail.com","723 186 319",null,null,null,"X"]
[26011956,"AG",null,"xxxxxxxxx","xxxxxxxxx","2694000,2694016,","anna.rajpold@gmail.com",602575700,null,null,null,"X"]
[26011086,"AG",null,"xxxxxxxxx","xxxxxxxxx","2694000,2694050,","anna.stankiewicz@hotmail.com","503 035 233",null,null,null,"X"]
[26010965,"AG",null,"xxxxxxxxx","xxxxxxxxx","2694000,2694025,","zawartka.anna@gmail.com","662 118 217",null,null,null,"X"]
[26012018,"AG",null,"xxxxxxxxx","xxxxxxxxx","2694000,2694050,","headinstinct@spoko.pl","532 874 546",null,null,null,"X"]
[26010950,"AG",null,"xxxxxxxxx","xxxxxxxxx","2694000,2694050,","Przemekzamorski@poczta.fm","601 459 540",null,null,null,"X"]
[26011169,"AG",null,"xxxxxxxxx","xxxxxxxxx","2694000,2694017,","uszczakarek@gmail.com",661955084,null,null,null,"X"]
[26011953,"AG",null,"xxxxxxxxx","xxxxxxxxx","2694000,2694025,","marcinsikorskii@wp.pl","789 451 330","PL9571121411",null,null,"X"]
[26010503,"AG",null,"xxxxxxxxx","xxxxxxxxx","2694000,2694050,","pharam@wp.pl","501 195 499",null,null,null,"X"]
[26012029,"AG",null,"xxxxxxxxx","xxxxxxxxx","2694000,2694017,","arturhaber@op.pl","504 920 710","PL7361573873",null,null,"X"]
[26010611,"AG",null,"xxxxxxxxx","xxxxxxxxx","2694000,2694050,","kasperski@aluplast.com.pl","604 79 58 54",null,null,null,"X"]
[26010631,"AG",null,"xxxxxxxxx","xxxxxxxxx","2694000,2694025,","artur@squashandmore.pl",null,"PL6262178133",null,"X","X"]
[26011182,"AG",null,"xxxxxxxxx","xxxxxxxxx","2694000,2694017,","asiaski24@gmail.com",601324603,"PL5213393977",null,"X","X"]
[26010852,"AG",null,"xxxxxxxxx","xxxxxxxxx","2694000,2694025,","jola@atlanticsports.pl","502 322 606","PL6762282230",null,null,"X"]
[26010094,"AG",null,"xxxxxxxxx","xxxxxxxxx","2694000,2694016,","jaroslaw_paja@yahoo.com",602245137,"PL6771088987",null,null,"X"]
[26010096,"AG",null,"xxxxxxxxx","xxxxxxxxx","2694000,2694017,","konrad@snowboard24.pl",606372608,"PL6762266745",null,null,"X"]
[26011663,"AG",null,"xxxxxxxxx","xxxxxxxxx","2694000,2694025,","martin.czakanski@gmail.com",697050509,"PL6342756916",null,null,"X"]
[26011490,"AG",null,"xxxxxxxxx","xxxxxxxxx","2694000,2694017,","md@bfc.pl","509 904 872","PL1132953275",null,null,"X"]
[26010486,"AG",null,"xxxxxxxxx","xxxxxxxxx","2694000,2694016,","bikeandmike@googlemail.com","884 637 047","PL6112553463",null,"X","X"]
[26010681,"AG",null,"xxxxxxxxx","xxxxxxxxx","2694000,2694025,","wojciech.wrzol@bdm.pl","501 307 154",null,null,null,"X"]
[26011410,"AG",null,"xxxxxxxxx","xxxxxxxxx","2694000,2694016,","kontakt@nowaosada.pl",601821150,"PL5481052897",null,null,"X"]
[26011662,"AG",null,"xxxxxxxxx","xxxxxxxxx","2694000,2694017,","craft.events.incentives@gmail.com",606781212,"PL8952223473",null,null,"X"]
[26011447,"AG",null,"xxxxxxxxx","xxxxxxxxx","2694000,2694050,","fakturyelektroniczne@bnpparibas.pl",null,"PL5261008546",null,null,"X"]
[26011787,"AG",null,"xxxxxxxxx","xxxxxxxxx","2694000,2694025,","boardhouse.sklep@gmail.com","692 214 114","PL6792848009",null,null,"X"]
[26010596,"AG",null,"xxxxxxxxx","xxxxxxxxx","2694000,2694017,","bojan@bojan.com.pl","601 42 88 26","PL9541369081",null,null,"X"]
[26011967,"AG",null,"xxxxxxxxx","xxxxxxxxx","2694000,2694017,","a.szot@garbaruk.com",883008341,null,null,null,"X"]
[26012098,"AG",null,"xxxxxxxxx","xxxxxxxxx","2694000,2694025,","biuro@bazasportgdynia.pl","535 020 090","PL5861774852",null,"X","X"]
[26010083,"AG",null,"xxxxxxxxx","xxxxxxxxx","2694000,2694016,","haski@ceti.com.pl",601417016,null,null,null,"X"]
[26011813,"AG",null,"xxxxxxxxx","xxxxxxxxx","2694000,2694025,","korty@sunwaysport.com","798 301 055","PL8842749085",null,null,"X"]
[26011272,"AG",null,"xxxxxxxxx","xxxxxxxxx","2694000,2694025,","biuro@sportstrade.pl","75 7323008",null,null,null,"X"]
[26010585,"AG",null,"xxxxxxxxx","xxxxxxxxx","2694000,2694016,","m.szmytkowska@babyssecret.pl","508 547 561",null,null,null,"X"]
[26010751,"AG",null,"xxxxxxxxx","xxxxxxxxx","2694000,2694017,","balticamedia@gmail.com",null,"PL8641721890",null,null,"X"]
[26011379,"AG",null,"xxxxxxxxx","xxxxxxxxx","2694000,2694050,","biela@biela.net.pl","503-387-335",null,null,null,"X"]
[26011763,"AG",null,"xxxxxxxxx","xxxxxxxxx","2694000,2694025,","marcin.stanuszek@gmail.com",506099009,null,null,null,"X"]
[26011018,"AG",null,"xxxxxxxxx","xxxxxxxxx","2694000,2694025,","ciakbartosz@gmail.com",796422601,null,null,null,"X"]
[26011739,"AG",null,"xxxxxxxxx","xxxxxxxxx","2694000,2694025,","poczta@globallsport.pl","693 664 999","PL5581740384",null,"X","X"]
[26011083,"AG",null,"xxxxxxxxx","xxxxxxxxx","2694000,2694016,","rookski@gmail.com",508294154,null,null,null,"X"]
[26011187,"AG",null,"xxxxxxxxx","xxxxxxxxx","2694000,2694050,","Bart.krzem9@gmail.com","602 271 767",null,null,null,"X"]
[26011785,"AG",null,"xxxxxxxxx","xxxxxxxxx","2694000,2694025,","bart911@interia.eu","510 356 547","PL5992592703",null,null,"X"]
[26011350,"AG",null,"xxxxxxxxx","xxxxxxxxx","2694000,2694025,","roslonski.bartosz@gmail.com",505029821,null,null,null,"X"]
[26010951,"AG",null,"xxxxxxxxx","xxxxxxxxx","2694000,2694050,","tomsur@mp.pl","606 769 903",null,null,null,"X"]
[26011080,"AG",null,"xxxxxxxxx","xxxxxxxxx","2694000,2694025,","bwieczorek@zbmzdrowie.pl","607 080 402",null,null,null,"X"]
[26010507,"AG",null,"xxxxxxxxx","xxxxxxxxx","2694000,2694050,","bartekwojnar@interia.pl",886669699,null,null,null,"X"]
[26011805,"AG",null,"xxxxxxxxx","xxxxxxxxx","2694000,2694016,","wyciagi.bartus@gmail.com","506 659 177","PL8831860991",null,null,"X"]
[26010846,"AG",null,"xxxxxxxxx","xxxxxxxxx","2694000,2694017,","nartyolsztyn@wp.pl","+ 48 600 016 350","PL7640008215",null,"X","X"]
[26011417,"AG",null,"xxxxxxxxx","xxxxxxxxx","2694000,2694025,","guga11@wp.pl","501 308 069",null,null,null,"X"]
[26010654,"AG",null,"xxxxxxxxx","xxxxxxxxx","2694000,2694016,","szkola@ptak-team.pl","601 501 423",null,null,"X","X"]
[26011670,"AG",null,"xxxxxxxxx","xxxxxxxxx","2694000,2694016,","btyrpa84@gmail.com","666 611 862",null,null,null,"X"]
[26010575,"AG",null,"xxxxxxxxx","xxxxxxxxx","2694000,2694025,","j.stoklosa@pl.head.com","512 962 901",null,null,null,"X"]
[26012121,"AG",null,"xxxxxxxxx","xxxxxxxxx","2694000,","sadowska.beata@gmail.com","608 033 034","PL5241798203",null,"X","X"]
[26011509,"AG",null,"xxxxxxxxx","xxxxxxxxx","2694000,2694050,","biuro@wspolnyswiat.com.pl","501 174 592",null,null,null,"X"]
[26010380,"AG",null,"xxxxxxxxx","xxxxxxxxx","2694000,2694017,","delta_technika@onet.eu",null,null,null,null,"X"]
[26010770,"AG",null,"xxxxxxxxx","xxxxxxxxx","2694000,2694025,","benbudziak@me.com","511 102 102",null,null,null,"X"]
[26011432,"AG",null,"xxxxxxxxx","xxxxxxxxx","2694000,2694016,","bergsport@bergsport.pl","501 398 986","PL8951435368",null,null,"X"]
[26010389,"AG",null,"xxxxxxxxx","xxxxxxxxx","2694000,2694016,","biuro@albaw.pl",602752564,null,null,null,"X"]
[26011157,"AG",null,"xxxxxxxxx","xxxxxxxxx","2694000,2694017,","hryniszyn@onet.pl","577 019 493",null,null,null,"X"]
[26011002,"AG",null,"xxxxxxxxx","xxxxxxxxx","2694000,2694017,","jurasowka@gmail.com",604084695,null,null,null,"X"]
[26011842,"AG",null,"xxxxxxxxx","xxxxxxxxx","2694000,2694017,","serwis@bikeandski.pl",883114343,"PL7740021480",null,"X","X"]
[26010087,"AG",null,"xxxxxxxxx","xxxxxxxxx","2694000,2694017,","faktury@bikershop.pl",602323923,null,null,"X","X"]
[26011810,"AG",null,"xxxxxxxxx","xxxxxxxxx","2694000,2694016,","krzysztof@snowsense.pl","606 456 012","PL7342533766",null,null,"X"]
[26011356,"AG",null,"xxxxxxxxx","xxxxxxxxx","2694000,2694017,","sklep.bikeshop@gmail.com","604 907 305","PL5170385823",null,"X","X"]
[26012088,"AG",null,"xxxxxxxxx","xxxxxxxxx","2694000,2694016,","mkarpinski@almatur.pl","501 504 028","PL5260304320",null,null,"X"]
[26010031,"AG",null,"xxxxxxxxx","xxxxxxxxx","2694000,2694016,","biuro@startbeskid.pl",602692845,null,null,null,"X"]
[26011031,"AG",null,"xxxxxxxxx","xxxxxxxxx","2694000,2694025,","piotr.szumilewicz@gmail.com",602350748,"PL5862282973",null,"X","X"]
[26010147,"AG",null,"xxxxxxxxx","xxxxxxxxx","2694000,2694017,","michal.slabon@hitsport.pl",602346732,"PL7342552410",null,null,"X"]
[26010429,"AG",null,"xxxxxxxxx","xxxxxxxxx","2694000,2694017,","grzegorz.bieda@gmail.com",null,null,null,"X","X"]
[26010153,"AG",null,"xxxxxxxxx","xxxxxxxxx","2694000,2694016,","mcison@gmail.com",604799947,null,null,null,"X"]
[26010231,"AG",null,"xxxxxxxxx","xxxxxxxxx","2694000,2694025,","tenis_club_piter_play@vp.pl",602866640,null,null,null,"X"]
[26011698,"AG",null,"xxxxxxxxx","xxxxxxxxx","2694000,2694025,","sklep@sklepzdeskami.pl",694913010,"PL7810041388",null,"X","X"]
[26011624,"AG",null,"xxxxxxxxx","xxxxxxxxx","2694000,2694050,","jolarusin@hotmail.com","609 491 934",null,null,null,"X"]
[26011391,"AG",null,"xxxxxxxxx","xxxxxxxxx","2694000,2694050,","bogdan@panorama777.pl","696 469 031",null,null,null,"X"]
[26010974,"AG",null,"xxxxxxxxx","xxxxxxxxx","2694000,2694016,","pietrykowski@gmail.com","601 474 498","PL8982122593",null,"X","X"]
[26011256,"AG",null,"xxxxxxxxx","xxxxxxxxx","2694000,2694050,","boleslawszmyd@tlen.pl","509 694 112",null,null,null,"X"]
[26011135,"AG",null,"xxxxxxxxx","xxxxxxxxx","2694000,2694025,","bozenaslowik1@gmail.com","691 554 205",null,null,null,"X"]
[26011757,"AG",null,"xxxxxxxxx","xxxxxxxxx","2694000,2694025,","brossport@op.pl",666378686,null,null,null,"X"]
[26010324,"AG",null,"xxxxxxxxx","xxxxxxxxx","2694000,2694017,","bfc@bfc.com.pl","48 022 670 01 25","PL1132288317",null,null,"X"]
[26011471,"AG",null,"xxxxxxxxx","xxxxxxxxx","2694000,2694025,","bernatowicz.d@gmail.com","506 141 926",null,null,"X","X"]
[26011736,"AG",null,"xxxxxxxxx","xxxxxxxxx","2694000,2694050,","transjet@transjet.pl","665 096 999",null,null,null,"X"]
[26012087,"AG",null,"xxxxxxxxx","xxxxxxxxx","2694000,2694025,","adampajestka@tlen.pl","509 685 880","PL1990124344",null,"X","X"]
[26010024,"AG",null,"xxxxxxxxx","xxxxxxxxx","2694000,2694016,","krzysztof.klecha@centrumrowerowe.pl",530907888,"PL9532634721",null,"X","X"]
[26010877,"AG",null,"xxxxxxxxx","xxxxxxxxx","2694000,2694017,","tomaszlysak@icloud.com",500826706,null,null,null,"X"]
[26010620,"AG",null,"xxxxxxxxx","xxxxxxxxx","2694000,2694016,","mosicka@interia.pl",509649125,"PL5531002276",null,null,"X"]
[26011853,"AG",null,"xxxxxxxxx","xxxxxxxxx","2694000,2694017,","info.slonecznadolina@gmail.com","607 741 843",null,null,null,"X"]
[26012048,"AG",null,"xxxxxxxxx","xxxxxxxxx","2694000,2694025,","bocian@centrumbocian.pl","501 638 514",null,null,null,"X"]
[26010957,"AG",null,"xxxxxxxxx","xxxxxxxxx","2694000,2694016,","remikslawik@o2.pl","880 300 777","PL8811483953",null,null,"X"]
[26011962,"AG",null,"xxxxxxxxx","xxxxxxxxx","2694000,2694016,","biuro@vip-ski.pl",507124829,"PL8943085853",null,"X","X"]
[26010209,"AG",null,"xxxxxxxxx","xxxxxxxxx","2694000,2694017,","adamkasiarz@op.pl",504003239,"PL7351559127",null,null,"X"]
[26010171,"AG",null,"xxxxxxxxx","xxxxxxxxx","2694000,2694017,","pawel.tarapacki@pgnig.pl",668465450,"PL1230039733",null,null,"X"]
[26011837,"AG",null,"xxxxxxxxx","xxxxxxxxx","2694000,2694025,","tenis@come-on.pl","696 024 633","PL8961546796",null,"X","X"]
[26010326,"AG",null,"xxxxxxxxx","xxxxxxxxx","2694000,2694017,","magazyn@coolsport.pl","0048 12 4224846","PL6771950257",null,"X","X"]
[26010076,"AG",null,"xxxxxxxxx","xxxxxxxxx","2694000,2694017,","borysswic@gmail.com",601866544,"PL8141421995",null,"X","X"]
[26010539,"AG",null,"xxxxxxxxx","xxxxxxxxx","2694000,2694025,","olek@freeriders.com.pl","606 611 688",null,null,null,"X"]
[26011260,"AG",null,"xxxxxxxxx","xxxxxxxxx","2694000,2694017,","tomaszlysak@icloud.com",500826706,null,null,null,"X"]
[26010212,"AG",null,"xxxxxxxxx","xxxxxxxxx","2694000,2694025,","jacek@butkiewicz.pl",603997599,"PL8392914324",null,null,"X"]
[26011870,"AG",null,"xxxxxxxxx","xxxxxxxxx","2694000,2694025,","piotr@prosquash.pl",501746927,"PL7792017906",null,null,"X"]
[26010072,"AG",null,"xxxxxxxxx","xxxxxxxxx","2694000,2694017,","arek@skiexpert.pl",601408950,null,null,null,"X"]
[26012020,"AG",null,"xxxxxxxxx","xxxxxxxxx","2694000,2694025,","eurogrzyb@o2.pl",509925919,"PL9592047743",null,"X","X"]
[26010906,"AG",null,"xxxxxxxxx","xxxxxxxxx","2694000,2694025,","trenerwrobel@gmail.com",508100992,null,null,null,"X"]
[26010522,"AG",null,"xxxxxxxxx","xxxxxxxxx","2694000,2694017,","Stawarski@zakopane-ski.pl",602360910,"PL7361080567",null,null,"X"]
[26010261,"AG",null,"xxxxxxxxx","xxxxxxxxx","2694000,2694025,","ctprestige2007@gmail.com",505101101,null,null,null,"X"]
[26011342,"AG",null,"xxxxxxxxx","xxxxxxxxx","2694000,2694050,","julia.chodkowska2005@gmail.com",null,"PL7611189757",null,null,"X"]
[26011146,"AG",null,"xxxxxxxxx","xxxxxxxxx","2694000,2694025,","krzysztof.fabin@citysports.com.pl","607 110 117","PL9452174861",null,null,"X"]
[26010510,"AG",null,"xxxxxxxxx","xxxxxxxxx","2694000,2694017,","Piotr.kucharz@gmail.com","601 500 071","PL9691347721",null,null,"X"]
[26011557,"AG",null,"xxxxxxxxx","xxxxxxxxx","2694000,2694025,","jedrzej.domaszewicz@gmail.com","508 303 101",null,null,null,"X"]
[26011508,"AG",null,"xxxxxxxxx","xxxxxxxxx","2694000,2694025,","hubert.paszkowski@cpinvestment.pl","512 210 945","PL6772389113",null,"X","X"]
[26012093,"AG",null,"xxxxxxxxx","xxxxxxxxx","2694000,2694017,","md@craft-events.com",606781212,"PL8952223473",null,null,"X"]
[26010570,"AG",null,"xxxxxxxxx","xxxxxxxxx","2694000,2694017,","michal@cragsport.pl","501 362 500","PL6762464801",null,null,"X"]
[26010981,"AG",null,"xxxxxxxxx","xxxxxxxxx","2694000,2694016,","b.kalisz@customtop.eu","509 695 859",null,null,null,"X"]
[26011565,"AG",null,"xxxxxxxxx","xxxxxxxxx","2694000,2694016,","marketing@czorsztynski.com","661 920 292","PL7352229538",null,null,"X"]
[26010449,"AG",null,"xxxxxxxxx","xxxxxxxxx","2694000,2694025,","biuro@sklepbiegacza.pl","500-425-540",null,null,null,"X"]
[26011173,"AG",null,"xxxxxxxxx","xxxxxxxxx","2694000,2694025,","samek_magdalena@hotmail.com","605 075 831","PL9452055582",null,"X","X"]
[26010255,"AG",null,"xxxxxxxxx","xxxxxxxxx","2694000,2694017,","ksiegowosc@snowshop.pl",500502050,null,null,"X","X"]
[26012081,"AG",null,"xxxxxxxxx","xxxxxxxxx","2694025,2694000,","hubert.szynkielewski@gmail.com",697915785,"PL9710722285",null,null,"X"]
[26011446,"AG",null,"xxxxxxxxx","xxxxxxxxx","2694000,2694017,","biuro@dimbo.pl","502 429 536","PL5532541153",null,null,"X"]
[26011978,"AG",null,"xxxxxxxxx","xxxxxxxxx","2694000,2694016,","bienkowskigs@gmail.com",502737279,null,null,null,"X"]
[26011257,"AG",null,"xxxxxxxxx","xxxxxxxxx","2694000,2694025,","biuro@dzt.wroclaw.pl","604 205 505",null,null,"X","X"]
[26011100,"AG",null,"xxxxxxxxx","xxxxxxxxx","2694000,2694025,","info@sportown.pl","692 125 543","PL9512066538",null,null,"X"]
[26012063,"AG",null,"xxxxxxxxx","xxxxxxxxx","2694000,2694025,","dsquash74@gmail.com","+48 881 494 809",null,null,null,"X"]
[26011510,"AG",null,"xxxxxxxxx","xxxxxxxxx","2694000,2694050,","dagmara.nickel@younick.pl","+48 504 139 701",null,null,null,"X"]
[26011078,"AG",null,"xxxxxxxxx","xxxxxxxxx","2694000,2694025,","damian_choma1@hotmail.com",733252515,null,null,null,"X"]
[26011174,"AG",null,"xxxxxxxxx","xxxxxxxxx","2694000,2694025,","damianmusial924@gmail.com","508 232 458",null,null,null,"X"]
[26011728,"AG",null,"xxxxxxxxx","xxxxxxxxx","2694000,2694050,","damiano.piekarz@gmail.com","881 453 777",null,null,null,"X"]
[26010543,"AG",null,"xxxxxxxxx","xxxxxxxxx","2694000,2694050,","romek.michalski@gmail.com","603 560 022",null,null,null,"X"]
[26011955,"AG",null,"xxxxxxxxx","xxxxxxxxx","2694000,2694025,","daniel.polkoszek@tenisgolf.legia.com","+48 604-437-733",null,null,null,"X"]
[26011056,"AG",null,"xxxxxxxxx","xxxxxxxxx","2694000,2694025,","danutasroka@interia.pl","603 663 454",null,null,null,"X"]
[26012067,"AG",null,"xxxxxxxxx","xxxxxxxxx","2694000,2694050,","Danuta.wasiela@onet.eu","661 767 818",null,null,null,"X"]
[26011729,"AG",null,"xxxxxxxxx","xxxxxxxxx","2694000,2694050,","joker25@wp.pl","697-071-982",null,null,null,"X"]
[26011696,"AG",null,"xxxxxxxxx","xxxxxxxxx","2694000,2694016,","mazurdarek@poczta.onet.pl","TEL 515 149 358","PL8991195516",null,"X","X"]
[26011347,"AG",null,"xxxxxxxxx","xxxxxxxxx","2694000,2694050,","dasaska@gmail.com","+48 504 089 042",null,null,null,"X"]
[26011251,"AG",null,"xxxxxxxxx","xxxxxxxxx","2694000,2694050,","widaros@wp.pl","505 308 309",null,null,null,"X"]
[26010664,"AG",null,"xxxxxxxxx","xxxxxxxxx","2694000,2694050,","dawid.antos@gmail.com","603 232 959",null,null,null,"X"]
[26011593,"AG",null,"xxxxxxxxx","xxxxxxxxx","2694000,2694025,","visionclub.tenis@gmail.com","502 584 108",null,null,"X","X"]
[26012001,"AG",null,"xxxxxxxxx","xxxxxxxxx","2694000,2694025,","dawidczyz@interia.eu","604 448 680",null,null,null,"X"]
[26010948,"AG",null,"xxxxxxxxx","xxxxxxxxx","2694000,2694015,","przemyslaw.jagiello@decathlon.com","692 482 013","PL9511855233",null,"X","X"]
[26011472,"AG",null,"xxxxxxxxx","xxxxxxxxx","2694000,2694017,","sklep@galeriasportowa.com","784 922 666","PL8212660969",null,"X","X"]
[26011938,"AG",null,"xxxxxxxxx","xxxxxxxxx","2694000,2694025,","Sebastian.Weber@unilever.com",601560360,null,null,null,"X"]
[26011520,"AG",null,"xxxxxxxxx","xxxxxxxxx","2694000,2694017,","biuro@dimbo.pl","502 429 536","PL5532537499",null,null,"X"]
[26011094,"AG",null,"xxxxxxxxx","xxxxxxxxx","2694000,2694017,","doboszsport@gmail.com",604956950,"PL6812067575",null,"X","X"]
[26011815,"AG",null,"xxxxxxxxx","xxxxxxxxx","2694000,2694017,","piotr@dobrenarty.pl","785 111 205","PL5130276298",null,"X","X"]
[26012053,"AG",null,"xxxxxxxxx","xxxxxxxxx","2694000,2694050,","d.rajpold@gshotel.pl","+ 48 602 170 500","PL9451997299",null,null,"X"]
[26011168,"AG",null,"xxxxxxxxx","xxxxxxxxx","2694000,2694025,","aleksandra.wojcik@avita.com.pl",509923179,null,null,null,"X"]
[26011829,"AG",null,"xxxxxxxxx","xxxxxxxxx","2694000,2694016,","sylwiaespe@wp.pl",511506818,"PL6111559067",null,null,"X"]
[26011861,"AG",null,"xxxxxxxxx","xxxxxxxxx","2694000,2694025,","pzarwanski@gmail.com","661 850 930",null,null,"X","X"]
[26011149,"AG",null,"xxxxxxxxx","xxxxxxxxx","2694000,2694016,","biuro@eblpolska.pl",693080808,"PL8942493780",null,null,"X"]
[26011875,"AG",null,"xxxxxxxxx","xxxxxxxxx","2694000,2694025,","jacusiep@wp.pl",691722999,"PL8781001730",null,null,"X"]
[26010004,"AG",null,"xxxxxxxxx","xxxxxxxxx","2694000,2694017,","biuro@emes-sport.pl",856534621,"PL5421132078",null,"X","X"]
[26010282,"AG",null,"xxxxxxxxx","xxxxxxxxx","2694000,2694016,","sklep@emisurf.pl",601714056,"PL8971006446",null,"X","X"]
[26011281,"AG",null,"xxxxxxxxx","xxxxxxxxx","2694000,2694025,","emti@emti.pl",null,null,null,"X","X"]
[26010019,"AG",null,"xxxxxxxxx","xxxxxxxxx","2694000,2694016,","sandra@happyskifriends.pl",603060273,"PL7471556812",null,null,"X"]
[26011578,"AG",null,"xxxxxxxxx","xxxxxxxxx","2694000,2694050,","mariusz.brzezinski@eurozet.pl","+48 502 773 772","PL5260026186",null,null,"X"]
[26010860,"AG",null,"xxxxxxxxx","xxxxxxxxx","2694000,2694017,","m.sawicki@easyride.pl","501-534-277","PL5212215972",null,null,"X"]
[26010996,"AG",null,"xxxxxxxxx","xxxxxxxxx","2694000,2694016,","qbaxride@gmail.com","509 967 692","PL9372722119",null,null,"X"]
[26012104,"AG",null,"xxxxxxxxx","xxxxxxxxx","2694000,2694025,","michalnispon@gmail.com",691019983,"PL5742078862",null,"X","X"]
[26011542,"AG",null,"xxxxxxxxx","xxxxxxxxx","2694000,2694025,","ecopless@gmail.com",668254244,"PL6381834796",null,null,"X"]
[26011156,"AG",null,"xxxxxxxxx","xxxxxxxxx","2694000,2694025,","instincttennis@gmail.com",509539548,null,null,null,"X"]
[26010014,"AG",null,"xxxxxxxxx","xxxxxxxxx","2694000,2694016,","kontakt@ekspert-sport.pl",504020199,"PL5471886230",null,"X","X"]
[26012057,"AG",null,"xxxxxxxxx","xxxxxxxxx","2694000,2694025,","malgorzatastanek.atc@gmail.com",602662505,"PL7341088206",null,null,"X"]
[26010139,"AG",null,"xxxxxxxxx","xxxxxxxxx","2694000,2694016,","info@energysports.pl",601937007,"PL8512959796",null,"X","X"]
[26010406,"AG",null,"xxxxxxxxx","xxxxxxxxx","2694000,2694016,","biuro@szczyrk-instruktorzy.pl","664 784 094","PL9372160584",null,null,"X"]
[26010266,"AG",null,"xxxxxxxxx","xxxxxxxxx","2694000,2694016,","andrzej.milewski@equipe.waw.pl",604790964,null,null,null,"X"]
[26011803,"AG",null,"xxxxxxxxx","xxxxxxxxx","2694000,2694016,","infoeskimoski@gmail.com","577 224 312",null,null,null,"X"]
[26010980,"AG",null,"xxxxxxxxx","xxxxxxxxx","2694000,2694025,","silver_squash@interia.pl","668 009 551",null,null,null,"X"]
[26011901,"AG",null,"xxxxxxxxx","xxxxxxxxx","2694000,2694017,","robert.nowosad@gmail.com",600328529,"PL6762483566",null,null,"X"]
[26011226,"AG",null,"xxxxxxxxx","xxxxxxxxx","2694000,2694017,","biuro@axel-sport.pl",508207141,"PL8133314658",null,"X","X"]
[26011209,"AG",null,"xxxxxxxxx","xxxxxxxxx","2694000,2694025,","marcinexploteam@gmail.com",669016380,"PL6252446000",null,null,"X"]
[26010383,"AG",null,"xxxxxxxxx","xxxxxxxxx","2694000,2694017,","holmenkol@holmenkol.pl","608 532 832","PL7360002708",null,null,"X"]
[26011196,"AG",null,"xxxxxxxxx","xxxxxxxxx","2694000,2694016,","agasza@gmail.com","501 364010",null,null,null,"X"]
[26011943,"AG",null,"xxxxxxxxx","xxxxxxxxx","2694000,2694025,","fhkawa@poczta.onet.pl","604 960 451",null,null,null,"X"]
[26010789,"AG",null,"xxxxxxxxx","xxxxxxxxx","2694000,2694017,","maximxx@o2.pl",null,"PL7351127675",null,null,"X"]
[26010124,"AG",null,"xxxxxxxxx","xxxxxxxxx","2694000,2694016,","kbarczak@sporting.com.pl",600072739,"PL6970011088",null,"X","X"]
[26011360,"AG",null,"xxxxxxxxx","xxxxxxxxx","2694000,2694017,","kolegowk@uek.krakow.pl",null,"PL6761307198",null,null,"X"]
[26010036,"AG",null,"xxxxxxxxx","xxxxxxxxx","2694000,2694016,","marcin@forehand.pl",343655859,null,null,null,"X"]
[26010481,"AG",null,"xxxxxxxxx","xxxxxxxxx","2694000,2694025,","golsklep@o2.pl",183375603,"PL7372137348",null,null,"X"]
[26011005,"AG",null,"xxxxxxxxx","xxxxxxxxx","2694000,2694017,","lc@horecaservice.pl",787494975,"PL9482321338",null,null,"X"]
[26010177,"AG",null,"xxxxxxxxx","xxxxxxxxx","2694000,2694017,","mariusz@chlebeksport.pl",696423527,"PL7351520680",null,"X","X"]
[26011407,"AG",null,"xxxxxxxxx","xxxxxxxxx","2694000,2694025,","blazejkoniusz@yahoo.pl","694 531 034",null,null,null,"X"]
[26010374,"AG",null,"xxxxxxxxx","xxxxxxxxx","2694000,2694017,","gapola@interia.pl",604499580,"PL7381180272",null,null,"X"]
[26010699,"AG",null,"xxxxxxxxx","xxxxxxxxx","2694000,2694025,","k.kwosek@gmail.com",500847462,null,null,"X","X"]
[26010235,"AG",null,"xxxxxxxxx","xxxxxxxxx","2694000,2694017,","pidnarty@op.pl",501614923,null,null,null,"X"]
[26010797,"AG",null,"xxxxxxxxx","xxxxxxxxx","2694000,2694017,","info@skiart.com.pl",600377383,"PL7361585327",null,null,"X"]
[26010730,"AG",null,"xxxxxxxxx","xxxxxxxxx","2694000,2694025,","allegro@reni-sport.pl","604 626 760","PL6811786440",null,null,"X"]
[26010320,"AG",null,"xxxxxxxxx","xxxxxxxxx","2694000,2694016,","sport2002@op.pl",601574488,"PL6112466379",null,"X","X"]
[26010668,"AG",null,"xxxxxxxxx","xxxxxxxxx","2694000,2694025,","michal.kostecki1@gmail.com","694 399 001",null,null,"X","X"]
[26010918,"AG",null,"xxxxxxxxx","xxxxxxxxx","2694000,2694017,","biela@biela.net.pl","502-542-453","PL7361403852",null,"X","X"]
[26011039,"AG",null,"xxxxxxxxx","xxxxxxxxx","2694000,2694017,","staszelowka@gmail.com",604633345,"PL7361034610",null,null,"X"]
[26010133,"AG",null,"xxxxxxxxx","xxxxxxxxx","2694000,2694016,","fabiansport@op.pl",426406023,"PL7262459720",null,null,"X"]
[26010202,"AG",null,"xxxxxxxxx","xxxxxxxxx","2694000,2694017,","sport@fan-sport.pl",null,"PL8131015957",null,"X","X"]
[26010816,"AG",null,"xxxxxxxxx","xxxxxxxxx","2694000,2694025,","mateuszfigas@wp.pl",602195869,"PL5542907176",null,"X","X"]
[26010800,"AG",null,"xxxxxxxxx","xxxxxxxxx","2694000,2694017,","arek@ski-expert.pl",601408950,"PL6571659876",null,null,"X"]
[26010836,"AG",null,"xxxxxxxxx","xxxxxxxxx","2694000,2694016,","malinowskijarek@tlen.pl","504 053 734","PL6191392220",null,"X","X"]
[26010914,"AG",null,"xxxxxxxxx","xxxxxxxxx","2694000,2694025,","kukucz-legien@wp.pl","509 280 500",null,null,null,"X"]
[26010801,"AG",null,"xxxxxxxxx","xxxxxxxxx","2694000,2694016,","biuro@kursport.pl",519514100,"PL7342535647",null,null,"X"]
[26011389,"AG",null,"xxxxxxxxx","xxxxxxxxx","2694000,2694016,","staszel.anna@gmail.com","661 920 292","PL7352149348",null,null,"X"]
[26010655,"AG",null,"xxxxxxxxx","xxxxxxxxx","2694000,2694017,","mitransmb@wp.pl","+48 604 249 297",null,null,null,"X"]
[26010022,"AG",null,"xxxxxxxxx","xxxxxxxxx","2694000,2694017,","biuro@skiart.com.pl",600377383,null,null,null,"X"]
[26011777,"AG",null,"xxxxxxxxx","xxxxxxxxx","2694000,2694025,","smolinb@gmail.com",null,"PL6452488569",null,"X","X"]
[26011022,"AG",null,"xxxxxxxxx","xxxxxxxxx","2694000,2694017,","surfbaltyk@poczta.onet.pl","+48 605 100 495","PL8391515504",null,"X","X"]
[26010240,"AG",null,"xxxxxxxxx","xxxxxxxxx","2694000,2694017,","szuk55@o2.pl",601990084,null,null,null,"X"]
[26010652,"AG",null,"xxxxxxxxx","xxxxxxxxx","2694000,2694025,","Tenismax@konto.pl",506178820,null,null,null,"X"]
[26010176,"AG",null,"xxxxxxxxx","xxxxxxxxx","2694000,2694017,","uniwers_michal.tkaczyk@op.pl",519539007,"PL7341822847",null,null,"X"]
[26011037,"AG",null,"xxxxxxxxx","xxxxxxxxx","2694000,2694017,","tanirabka@wp.eu",48692446979,"PL7352814136",null,null,"X"]
[26010319,"AG",null,"xxxxxxxxx","xxxxxxxxx","2694000,2694016,","sklep@zibitop.pl",504085282,"PL5531656144",null,null,"X"]
[26010450,"AG",null,"xxxxxxxxx","xxxxxxxxx","2694000,2694016,","kontakt@sportforever.eu",601227647,"PL6110100094",null,"X","X"]
[26011301,"AG",null,"xxxxxxxxx","xxxxxxxxx","2694000,2694025,","patmaj91@gmail.com","791 861 671","PL8133630141",null,"X","X"]
[26010995,"AG",null,"xxxxxxxxx","xxxxxxxxx","2694000,2694025,","maciek19063@gmail.com","503 074 478",null,null,null,"X"]
[26010831,"AG",null,"xxxxxxxxx","xxxxxxxxx","2694000,2694025,","fphu.janusz@gmail.com","22 654 97 20","PL5341032251",null,"X","X"]
[26010680,"AG",null,"xxxxxxxxx","xxxxxxxxx","2694000,2694025,","bozenasorychta@onet.pl","609 823 953",null,null,null,"X"]
[26010361,"AG",null,"xxxxxxxxx","xxxxxxxxx","2694000,2694016,","biuro@funrace.pl","+48 501 724 216","PL7352474657",null,"X","X"]
[26011568,"AG",null,"xxxxxxxxx","xxxxxxxxx","2694000,2694025,","diana.Lewandowska@TenisKozerki.pl","519 303 530","PL5291808903",null,null,"X"]
[26011778,"AG",null,"xxxxxxxxx","xxxxxxxxx","2694000,2694016,","kingus77@interia.pl",501684130,null,null,null,"X"]
[26011097,"AG",null,"xxxxxxxxx","xxxxxxxxx","2694000,2694025,","artur.bochenek@sportsgroup.pl","513 460 460",null,null,null,"X"]
[26010767,"AG",null,"xxxxxxxxx","xxxxxxxxx","2694000,2694016,","srokaaleksandra31@gmail.com",null,null,null,null,"X"]
[26010398,"AG",null,"xxxxxxxxx","xxxxxxxxx","2694000,2694017,","wojtek@kitejunkies.pl",883159811,null,null,null,"X"]
[26011113,"AG",null,"xxxxxxxxx","xxxxxxxxx","2694000,2694025,","konrad.wojtasik@grzegorzecki.pl","502 905 190","PL6793129570",null,null,"X"]
[26011050,"AG",null,"xxxxxxxxx","xxxxxxxxx","2694000,2694025,","konrad.wojtasik@grzegorzecki.pl",502905190,"PL6793129570",null,null,"X"]
[26010985,"AG",null,"xxxxxxxxx","xxxxxxxxx","2694000,2694016,","a.balec@fansport.gliwice.pl","609 529 002","PL6311024537",null,"X","X"]
[26010491,"AG",null,"xxxxxxxxx","xxxxxxxxx","2694000,2694017,","sklep@locales.com.pl","501 145 561","PL5871701228",null,"X","X"]
[26011131,"AG",null,"xxxxxxxxx","xxxxxxxxx","2694000,2694017,","hudinikaz@op.pl",null,null,null,"X","X"]
[26010613,"AG",null,"xxxxxxxxx","xxxxxxxxx","2694000,2694050,","jacek.kolasinski@packpartner.pl","601 618 196",null,null,null,"X"]
[26011682,"AG",null,"xxxxxxxxx","xxxxxxxxx","2694000,2694016,","filiprzepecki@gmail.com","+48 512 587 888","PL7352858926",null,null,"X"]
[26011788,"AG",null,"xxxxxxxxx","xxxxxxxxx","2694000,2694025,","filip.stolecki@op.pl",790329900,null,null,null,"X"]
[26011038,"AG",null,"xxxxxxxxx","xxxxxxxxx","2694000,2694017,","gosia22a@op.pl","600 008 406",null,null,null,"X"]
[26011617,"AG",null,"xxxxxxxxx","xxxxxxxxx","2694000,2694025,","vektronroj@poczta.fm","602 229 658","PL7361034952",null,null,"X"]
[26011881,"AG",null,"xxxxxxxxx","xxxxxxxxx","2694000,2694017,","mitransmb@wp.pl","+48 604 249 297","PL7352888258",null,null,"X"]
[26011942,"AG",null,"xxxxxxxxx","xxxxxxxxx","2694000,2694016,","aj34@wp.pl",601455227,null,null,null,"X"]
[26011049,"AG",null,"xxxxxxxxx","xxxxxxxxx","2694000,2694016,","biuro@azik.pl","517 459 113",null,null,null,"X"]
[26011972,"AG",null,"xxxxxxxxx","xxxxxxxxx","2694000,2694025,","karoldus@interia.pl",48604990773,null,null,null,"X"]
[26010925,"AG",null,"xxxxxxxxx","xxxxxxxxx","2694000,2694016,","jkubik@dbpatron.pl","536 998 877",null,null,null,"X"]
[26011085,"AG",null,"xxxxxxxxx","xxxxxxxxx","2694000,2694016,","mpatex@op.pl","664 480 963",null,null,null,"X"]
[26012100,"AG",null,"xxxxxxxxx","xxxxxxxxx","2694000,2694016,","info@forszty.pl","508 368 797",null,null,null,"X"]
[26010772,"AG",null,"xxxxxxxxx","xxxxxxxxx","2694000,2694017,","biuro@ski-service.pl","566 210 358","PL8790173465",null,null,"X"]
[26011766,"AG",null,"xxxxxxxxx","xxxxxxxxx","2694000,2694050,","kuba@etc.szczecin.pl",606330304,null,null,null,"X"]
[26011529,"AG",null,"xxxxxxxxx","xxxxxxxxx","2694000,2694025,","irek.szczurowski@gmail.com","790 252 010","PL5441114103",null,"X","X"]
[26010009,"AG",null,"xxxxxxxxx","xxxxxxxxx","2694000,2694016,","dendys@carvingsport.pl",791111000,"PL5471534525",null,null,"X"]
[26012006,"AG",null,"xxxxxxxxx","xxxxxxxxx","2694000,2694016,","kubakondrat@gmail.com","604 902 956",null,null,null,"X"]
[26010622,"AG",null,"xxxxxxxxx","xxxxxxxxx","2694000,2694025,","jacek.pruciak@gmail.com","606 146 891",null,null,null,"X"]
[26011535,"AG",null,"xxxxxxxxx","xxxxxxxxx","2694000,2694025,","sebastian.weber@unilever.com","601 560 360","PL1132055642",null,null,"X"]
[26011435,"AG",null,"xxxxxxxxx","xxxxxxxxx","2694000,2694017,","anetaps@icloud.com",602810249,"PL7381151000",null,null,"X"]
[26010216,"AG",null,"xxxxxxxxx","xxxxxxxxx","2694000,2694017,","info@funschool.pl",692001268,null,null,null,"X"]
[26011819,"AG",null,"xxxxxxxxx","xxxxxxxxx","2694000,2694025,","visionclub.tenis@gmail.com",502584108,null,null,null,"X"]
[26010955,"AG",null,"xxxxxxxxx","xxxxxxxxx","2694000,2694016,","piotr.u.awf@gmail.com",606913809,null,null,null,"X"]
[26011951,"AG",null,"xxxxxxxxx","xxxxxxxxx","2694000,2694016,","ams.stachowiak@gmail.com",509401543,null,null,null,"X"]
[26012099,"AG",null,"xxxxxxxxx","xxxxxxxxx","2694000,2694025,","kontakt@akademiabigpoint.pl","506 538 081",null,null,null,"X"]
[26012066,"AG",null,"xxxxxxxxx","xxxxxxxxx","2694000,2694016,","rafalhomeberry@gmail.com","724 950 554",null,null,"X","X"]
[26010989,"AG",null,"xxxxxxxxx","xxxxxxxxx","2694000,2694025,","biuro@twojstartup.pl","602 334 850","PL5213641211",null,null,"X"]
[26011300,"AG",null,"xxxxxxxxx","xxxxxxxxx","2694000,2694050,","wrobeg@gmail.com","604 094 018",null,null,null,"X"]
[26011413,"AG",null,"xxxxxxxxx","xxxxxxxxx","2694000,2694050,","wrobeg@gmail.com","604 094 018",null,null,"X","X"]
[26010984,"AG",null,"xxxxxxxxx","xxxxxxxxx","2694000,2694025,","magdalena.guz@legia.pl","592 623 751",null,null,"X","X"]
[26011261,"AG",null,"xxxxxxxxx","xxxxxxxxx","2694000,2694025,","andrzej.rosol@gmail.com",null,null,null,"X","X"]
[26011258,"AG",null,"xxxxxxxxx","xxxxxxxxx","2694000,2694025,","kaczmarczyk@data.pl","601 707 946",null,null,null,"X"]
[26010931,"AG",null,"xxxxxxxxx","xxxxxxxxx","2694000,2694025,","sklep@pro.shop.pl",505300711,"PL8951769419",null,"X","X"]
[26010302,"AG",null,"xxxxxxxxx","xxxxxxxxx","2694000,2694017,","gajski@wp.pl",664056648,null,null,null,"X"]
[26011905,"AG",null,"xxxxxxxxx","xxxxxxxxx","2694000,2694025,","gdyniapadelclub@gmail.com","+48 534044544","PL9581717223",null,null,"X"]
[26011420,"AG",null,"xxxxxxxxx","xxxxxxxxx","2694000,2694025,","andrzej.rosol@tennis-open.pl",48609271277,"PL2220916096",null,null,"X"]
[26010762,"AG",null,"xxxxxxxxx","xxxxxxxxx","2694000,2694025,","BIURO@GEOGRUPA.PL",null,null,null,null,"X"]
[26010290,"AG",null,"xxxxxxxxx","xxxxxxxxx","2694000,2694016,","ikscimota@gmail.com",601081169,null,null,"X","X"]
[26010066,"AG",null,"xxxxxxxxx","xxxxxxxxx","2694000,2694025,","biuro@global-l.pl",606959975,null,null,null,"X"]
[26011046,"AG",null,"xxxxxxxxx","xxxxxxxxx","2694000,2694016,","glowackirafal@interia.pl","505 004 121",null,null,null,"X"]
[26011216,"AG",null,"xxxxxxxxx","xxxxxxxxx","2694000,2694025,","czyzowski.marcin@gmail.com",null,null,null,null,"X"]
[26010273,"AG",null,"xxxxxxxxx","xxxxxxxxx","2694000,2694015,","PLKsiegowosc@sportmaster.eu",226113661,"PL9511861015",null,"X","X"]
[26010053,"AG",null,"xxxxxxxxx","xxxxxxxxx","2694000,2694017,","skiagus@gmail.com",604480160,"PL7361623275",null,null,"X"]
[26010137,"AG",null,"xxxxxxxxx","xxxxxxxxx","2694000,2694016,","fv@goldsport.pl",609829601,"PL7270007837",null,"X","X"]
[26011298,"AG",null,"xxxxxxxxx","xxxxxxxxx","2694000,2694025,","jgurski@online.de","+49/172/41-48...","PL5832875102",null,null,"X"]
[26011299,"AG",null,"xxxxxxxxx","xxxxxxxxx","2694000,2694025,","grabinski.ad@gmail.com","792 022 323",null,null,"X","X"]
[26010260,"AG",null,"xxxxxxxxx","xxxxxxxxx","2694000,2694017,","grantsc@onet.pl",604410775,"PL5261394093",null,null,"X"]
[26010635,"AG",null,"xxxxxxxxx","xxxxxxxxx","2694000,2694025,","biuro@wakacjezrakieta.pl",600852927,null,null,null,"X"]
[26011282,"AG",null,"xxxxxxxxx","xxxxxxxxx","2694000,2694016,","joanna.sleziona@beskidy.gopr.pl","534 250 007","PL7361039808",null,null,"X"]
[26010805,"AG",null,"xxxxxxxxx","xxxxxxxxx","2694000,2694016,","biuro@nartus.pl",508070677,null,null,null,"X"]
[26010008,"AG",null,"xxxxxxxxx","xxxxxxxxx","2694000,2694016,","info@grupaszafranski.pl",502775471,"PL5471976513",null,"X","X"]
[26011990,"AG",null,"xxxxxxxxx","xxxxxxxxx","2694000,2694016,","m.kaminski@rasc.pl","516 022 513","PL5211995755",null,null,"X"]
[26010719,"AG",null,"xxxxxxxxx","xxxxxxxxx","2694000,2694025,","paulina.borkowska@noblebank.pl",null,"PL1080004850",null,null,"X"]
[26010549,"AG",null,"xxxxxxxxx","xxxxxxxxx","2694000,2694025,","gibsport@gibsport.com.pl",null,null,null,null,"X"]
[26011045,"AG",null,"xxxxxxxxx","xxxxxxxxx","2694000,2694016,","wryjak@gmail.com","609 752 739",null,null,null,"X"]
[26010930,"AG",null,"xxxxxxxxx","xxxxxxxxx","2694000,2694025,","bpolowczuk1901@wroclawskaedukacja.pl","71 7986727 110",null,null,null,"X"]
[26010715,"AG",null,"xxxxxxxxx","xxxxxxxxx","2694000,2694025,2694050,","kasia.straczy@gmail.com","604 108 925",null,null,"X","X"]
[26010457,"AG",null,"xxxxxxxxx","xxxxxxxxx","2694000,2694025,","jbras@dobczyce.pl","12 37-21-703","PL6811004443",null,null,"X"]
[26010851,"AG",null,"xxxxxxxxx","xxxxxxxxx","2694000,2694016,","kancelaria@karpacz.eu",null,"PL6110107759",null,null,"X"]
[26011140,"AG",null,"xxxxxxxxx","xxxxxxxxx","2694000,2694025,","dareks32@wp.pl",603111442,null,null,null,"X"]
[26011404,"AG",null,"xxxxxxxxx","xxxxxxxxx","2694000,2694025,","robert.godlewski84@gmail.com","791 840 302","PL5992854215",null,null,"X"]
[26011259,"AG",null,"xxxxxxxxx","xxxxxxxxx","2694000,2694025,","j.wolasewicz@parktenisowy.pl",6912149284,null,null,null,"X"]
[26011403,"AG",null,"xxxxxxxxx","xxxxxxxxx","2694000,2694017,","a.jachymek@poczta.fm","606 317 320","PL8733264035",null,null,"X"]
[26010413,"AG",null,"xxxxxxxxx","xxxxxxxxx","2694000,2694025,","katarzyna.obrocka@e-walizki.pl","605 143 144",null,null,"X","X"]
[26011335,"AG",null,"xxxxxxxxx","xxxxxxxxx","2694000,2694016,","biuro@nartus.pl","508 070 676",null,null,"X","X"]
[26010502,"AG",null,"xxxxxxxxx","xxxxxxxxx","2694000,2694017,","gapola@interia.pl",604499580,null,null,null,"X"]
[26011204,"AG",null,"xxxxxxxxx","xxxxxxxxx","2694000,2694016,","grzesiek.figiel@wp.pl",532684871,null,null,null,"X"]
[26011243,"AG",null,"xxxxxxxxx","xxxxxxxxx","2694000,2694016,","grzegorzhille@op.pl","604 952 966",null,null,"X","X"]
[26010870,"AG",null,"xxxxxxxxx","xxxxxxxxx","2694000,2694016,","jumbo@jumbosport.pl","502 484 090",null,null,null,"X"]
[26011367,"AG",null,"xxxxxxxxx","xxxxxxxxx","2694000,2694025,","grzegorz.matenka@konicaminolta.pl","+48 600 478 493",null,null,null,"X"]
[26010605,"AG",null,"xxxxxxxxx","xxxxxxxxx","2694000,2694017,","grzegorz.so@gmail.com",603922642,null,null,null,"X"]
[26011074,"AG",null,"xxxxxxxxx","xxxxxxxxx","2694000,2694016,","grzemik@gmail.com","502 364 599",null,null,null,"X"]
[26010649,"AG",null,"xxxxxxxxx","xxxxxxxxx","2694000,2694050,","zgola@canpol.poznan.pl","501 288 277",null,null,"X","X"]
[26011456,"AG",null,"xxxxxxxxx","xxxxxxxxx","2694000,2694016,","klusyhd@o2.pl","604 934 311",null,null,null,"X"]
[26010907,"AG",null,"xxxxxxxxx","xxxxxxxxx","2694000,2694025,","sekretariat@gksgornik.leczna.pl","665 684 744",null,null,null,"X"]
[26011201,"AG",null,"xxxxxxxxx","xxxxxxxxx","2694000,2694025,","lukasz.sek@onet.pl","506 694 877",null,null,null,"X"]
[26011130,"AG",null,"xxxxxxxxx","xxxxxxxxx","2694000,2694016,","bokmiecik@gmail.com","602 226 420","PL6482778591",null,null,"X"]
[26010953,"AG",null,"xxxxxxxxx","xxxxxxxxx","2694000,2694017,","hmb@majchrowicz.eu",664724595,"PL7351002264",null,null,"X"]
[26010813,"AG",null,"xxxxxxxxx","xxxxxxxxx","2694000,2694025,","m.guz@hartphp.com.pl","48 77 45 66 316","PL7542748922",null,null,"X"]
[26010803,"AG",null,"xxxxxxxxx","xxxxxxxxx","2694000,2694017,","biuro@heavydutypolska.pl","501-22-88-89","PL5360018967",null,null,"X"]
[26010703,"AG",null,"xxxxxxxxx","xxxxxxxxx","2694000,2694016,","hubertwojcik@yahoo.com","662 130 664","PL6772384334",null,null,"X"]
[26012028,"AG",null,"xxxxxxxxx","xxxxxxxxx","2694000,2694017,","wojtek@hski.pl",502025628,"PL7361553391",null,"X","X"]
[26011835,"AG",null,"xxxxxxxxx","xxxxxxxxx","2694000,2694017,","info@krakowsport.pl",730043186,"PL6793224819",null,"X"]
[26010079,"AG",null,"xxxxxxxxx","xxxxxxxxx","2694000,2694016,","sklep@locales.com.pl",501145561,null,null,null,"X"]
[26011769,"AG",null,"xxxxxxxxx","xxxxxxxxx","2694000,2694016,","michal_grzesiak@o2.pl",787101871,"PL8831217976",null,null,"X"]
[26011348,"AG",null,"xxxxxxxxx","xxxxxxxxx","2694000,2694025,","dawidkapral@gmail.com","530 095 946",null,null,null,"X"]
[26010508,"AG",null,"xxxxxxxxx","xxxxxxxxx","2694000,2694017,","lost21@vp.pl",602775782,null,null,null,"X"]
[26010956,"AG",null,"xxxxxxxxx","xxxxxxxxx","2694000,2694015,","justajankowska22@gmail.com","510 520 283",null,null,null,"X"]
[26010799,"AG",null,"xxxxxxxxx","xxxxxxxxx","2694000,2694017,","hmisniakiewicz@gmail.com",660612970,null,null,null,"X"]
[26011727,"AG",null,"xxxxxxxxx","xxxxxxxxx","2694000,2694050,","mikolaj.telzynski@gmail.com","885 113 031",null,null,null,"X"]
[26010317,"AG",null,"xxxxxxxxx","xxxxxxxxx","2694000,2694017,","opelek69@wp.pl",888987287,null,null,null,"X"]
[26010424,"AG",null,"xxxxxxxxx","xxxxxxxxx","2694000,2694016,","harcerzopole@op.pl",602260824,"PL7540136534",null,"X","X"]
[26010633,"AG",null,"xxxxxxxxx","xxxxxxxxx","2694000,2694016,","Biuro@hski.pl","502 025 628",null,null,null,"X"]
[188,"AG",null,"xxxxxxxxx","xxxxxxxxx","2694000,","m.stanuszek@pl.head.com",null,"PL6793159967",null,null,"X"]
[187,"AG",null,"xxxxxxxxx","xxxxxxxxx","2694000,",null,"780 717 557","ATU36741905",null,"X"]
[26012058,"AG",null,"xxxxxxxxx","xxxxxxxxx","2694000,2694017,","jacek.moritz@gmail.com",601201196,null,null,null,"X"]
[26011152,"AG",null,"xxxxxxxxx","xxxxxxxxx","2694000,2694025,","hkornas@o2.pl","509 773 891",null,null,null,"X"]
[26010188,"AG",null,"xxxxxxxxx","xxxxxxxxx","2694000,2694016,","biuro@himaltrek.pl",662598255,"PL9720804636",null,null,"X"]
[26011752,"AG",null,"xxxxxxxxx","xxxxxxxxx","2694000,2694025,","kontakt@gemsetmecz.com.pl",733499520,"PL9570770946",null,"X","X"]
[26010720,"AG",null,"xxxxxxxxx","xxxxxxxxx","2694000,2694025,","paulina.borkowska@noblebank.pl",null,null,null,null,"X"]
[26011136,"AG",null,"xxxxxxxxx","xxxxxxxxx","2694000,2694017,","lc@horecaservice.pl",787494975,"PL6792988532",null,null,"X"]
[26011737,"AG",null,"xxxxxxxxx","xxxxxxxxx","2694000,2694016,","bartek@b-good.at","517 507 735","PL5481352091",null,"X","X"]
[26012112,"AG",null,"xxxxxxxxx","xxxxxxxxx","2694000,2694017,","oskarpieprzak@gmail.com",501686386,null,null,null,"X"]
[26012045,"AG",null,"xxxxxxxxx","xxxxxxxxx","2694000,2694050,","arytelewska@gmail.com","607 566 837",null,null,null,"X"]
[26010308,"AG",null,"xxxxxxxxx","xxxxxxxxx","2694000,2694025,","wojtek@hurtowniasportowa.net","68 452 86 86",null,null,null,"X"]
[26011133,"AG",null,"xxxxxxxxx","xxxxxxxxx","2694000,2694025,","dareks32@wp.pl","603 111 442",null,null,null,"X"]
[26010656,"AG",null,"xxxxxxxxx","xxxxxxxxx","2694000,2694016,","a.malysa@inmogilany.pl","12 444 50 60","PL6760000322",null,null,"X"]
[26011332,"AG",null,"xxxxxxxxx","xxxxxxxxx","2694000,2694025,","rafal.strzalkowski84@gmail.com",6008502927,"PL5993168410",null,null,"X"]
[26011685,"AG",null,"xxxxxxxxx","xxxxxxxxx","2694000,2694016,","info@wgumny.pl","601 710 106",null,null,null,"X"]
[26010913,"AG",null,"xxxxxxxxx","xxxxxxxxx","2694000,2694016,","firmaib.dziedzic@gmail.com","608 440 506","PL6111782569",null,"X","X"]
[26011700,"AG",null,"xxxxxxxxx","xxxxxxxxx","2694000,2694017,","info@interski.pl","606 433 084","PL7122744627",null,"X","X"]
[26011935,"AG",null,"xxxxxxxxx","xxxxxxxxx","2694000,2694025,","jacek@interpadel.no","+47 452 32 827","PL8513276941",null,"X","X"]
[26010126,"AG",null,"xxxxxxxxx","xxxxxxxxx","2694000,2694015,","faktury@intersport.pl",602614087,"PL6760016553",null,"X","X"]
[26011538,"AG",null,"xxxxxxxxx","xxxxxxxxx","2694000,2694016,","gawronska.aleksandra@gmail.com","502 090 921",null,null,null,"X"]
[26010127,"AG",null,"xxxxxxxxx","xxxxxxxxx","2694000,2694017,","irmaksportsc@gmail.com",603704564,"PL7122903190",null,"X","X"]
[26010108,"AG",null,"xxxxxxxxx","xxxxxxxxx","2694000,2694017,","Tomasz@isport.pl","607 055 425","PL6781816365",null,"X","X"]
[26010132,"AG",null,"xxxxxxxxx","xxxxxxxxx","2694000,2694025,","krzysiek_tenis@onet.eu",501722363,null,null,null,"X"]
[26011908,"AG",null,"xxxxxxxxx","xxxxxxxxx","2694000,2694016,","igorbucki@wp.pl","608 495 638",null,null,null,"X"]
[26011833,"AG",null,"xxxxxxxxx","xxxxxxxxx","2694000,2694025,","igorbujdo@op.pl",533608868,null,null,"X","X"]
[26011286,"AG",null,"xxxxxxxxx","xxxxxxxxx","2694000,2694016,","sikorski.igor90@gmail.com",514382651,null,null,null,"X"]
[26010806,"AG",null,"xxxxxxxxx","xxxxxxxxx","2694000,2694017,","a.malysa@inmogilany.pl",605071700,"PL6760000322",null,null,"X"]
[26011181,"AG",null,"xxxxxxxxx","xxxxxxxxx","2694000,2694025,","puchalski.jakub@gmail.com","503 055 877",null,null,null,"X"]
[26011713,"AG",null,"xxxxxxxxx","xxxxxxxxx","2694000,2694050,","blumarine1@wp.pl","600 044 065","PL7772527426",null,null,"X"]
[26010592,"AG",null,"xxxxxxxxx","xxxxxxxxx","2694000,2694017,","olek@freeriders.com.pl",null,"PL9512216788",null,null,"X"]
[26010826,"AG",null,"xxxxxxxxx","xxxxxxxxx","2694000,2694016,","slupinska.ewa@gmail.com",793456059,null,null,null,"X"]
[26010967,"AG",null,"xxxxxxxxx","xxxxxxxxx","2694000,2694025,","a-kostka@o2.pl","602 211 709",null,null,null,"X"]
[26011701,"AG",null,"xxxxxxxxx","xxxxxxxxx","2694000,2694016,","kontakt@intosport.pl","606 331 212",null,null,null,"X"]
[26011034,"AG",null,"xxxxxxxxx","xxxxxxxxx","2694000,2694016,","jarek.szurman@gmail.com",606987343,"PL6481948476",null,null,"X"]
[26010616,"AG",null,"xxxxxxxxx","xxxxxxxxx","2694000,2694017,","izimouse@wp.pl",503076220,null,null,null,"X"]
[26011506,"AG",null,"xxxxxxxxx","xxxxxxxxx","2694000,2694016,","biuro.wrosport@gmail.com","501 398 986","PL7491962188",null,"X","X"]
[26011189,"AG",null,"xxxxxxxxx","xxxxxxxxx","2694000,2694050,","monika.rajska@wp.pl","601 307 601",null,null,null,"X"]
[26010551,"AG",null,"xxxxxxxxx","xxxxxxxxx","2694000,2694016,","izerskachata@op.pl",607694827,"PL6161140838",null,null,"X"]
[26012106,"AG",null,"xxxxxxxxx","xxxxxxxxx","2694000,2694017,","jjarzabek@onet.eu","601 966 427","PL7361746144",null,null,"X"]
[26011711,"AG",null,"xxxxxxxxx","xxxxxxxxx","2694000,2694025,","jaroslaw.dejnarowicz@gmail.com","+48 728 434 722",null,null,null,"X"]
[26011891,"AG",null,"xxxxxxxxx","xxxxxxxxx","2694000,2694050,","daniel.polkoszek@tenisgolf.legia.com",604437733,"PL9522128436",null,null,"X"]
[26011750,"AG",null,"xxxxxxxxx","xxxxxxxxx","2694000,2694025,","michalnispon@gmail.com","691 019 983","PL7831814795",null,null,"X"]
[26011689,"AG",null,"xxxxxxxxx","xxxxxxxxx","2694000,2694017,","jaroslaw.jasica@gmail.com",601054545,"PL8733181823",null,"X","X"]
[26010743,"AG",null,"xxxxxxxxx","xxxxxxxxx","2694000,2694016,","jan.banas@sporteverest.pl","607 352 839",null,null,null,"X"]
[26011657,"AG",null,"xxxxxxxxx","xxxxxxxxx","2694000,2694025,","jan.stanski@wp.pl","606 607 344",null,null,null,"X"]
[26011572,"AG",null,"xxxxxxxxx","xxxxxxxxx","2694000,2694016,","jura_lviv@i.ua",977490000,null,null,null,"X"]
[26011390,"AG",null,"xxxxxxxxx","xxxxxxxxx","2694000,2694050,","kuba_wesolowski@wp.pl",519000100,"PL5321856776",null,null,"X"]
[26010794,"AG",null,"xxxxxxxxx","xxxxxxxxx","2694000,2694025,","Kuba_wesolowski@wp.pl",519000100,"PL5321856776",null,null,"X"]
[26010337,"AG",null,"xxxxxxxxx","xxxxxxxxx","2694000,2694017,","Anna.Maslyk@intersport.pl","48 12 44 48 252",null,null,"X","X"]
[26011824,"AG",null,"xxxxxxxxx","xxxxxxxxx","2694000,2694016,","jacek.nieglos@gmail.com","602 896 311",null,null,null,"X"]
[26011702,"AG",null,"xxxxxxxxx","xxxxxxxxx","2694000,2694025,","walekajacek@wp.pl",500030845,null,null,"X","X"]
[26010341,"AG",null,"xxxxxxxxx","xxxxxxxxx","2694000,2694017,","kubaiwan@o2.pl",501068534,null,null,null,"X"]
[26011707,"AG",null,"xxxxxxxxx","xxxxxxxxx","2694000,2694016,","jakub_klusak@onet.pl","728 210 553",null,null,null,"X"]
[26010746,"AG",null,"xxxxxxxxx","xxxxxxxxx","2694000,2694017,","piotr@dobrenarty.pl","785 111 205",null,null,"X","X"]
[26011277,"AG",null,"xxxxxxxxx","xxxxxxxxx","2694000,2694050,","jakub.pala@gmail.com","48 509 139 989",null,null,null,"X"]
[26011176,"AG",null,"xxxxxxxxx","xxxxxxxxx","2694000,2694017,","jak.soltys@gmail.com",null,null,null,null,"X"]
[26011372,"AG",null,"xxxxxxxxx","xxxxxxxxx","2694000,2694025,","sterniczukjakub@gmail.com",603092029,null,null,null,"X"]
[26011653,"AG",null,"xxxxxxxxx","xxxxxxxxx","2694000,2694050,","j.p.strzel@gmail.com","730 942 424",null,null,null,"X"]
[26011761,"AG",null,"xxxxxxxxx","xxxxxxxxx","2694000,2694050,","agunia1160@wp.pl","601 297 091",null,null,null,"X"]
[26010679,"AG",null,"xxxxxxxxx","xxxxxxxxx","2694000,2694050,","kzamorski98@interia.pl","605 908 660",null,null,null,"X"]
[26011607,"AG",null,"xxxxxxxxx","xxxxxxxxx","2694000,2694050,","bchlodnicki@polskiefermy.pl","604 565 059",null,null,null,"X"]
[26010304,"AG",null,"xxxxxxxxx","xxxxxxxxx","2694000,2694017,","jjarzabek@onet.eu",601966427,"PL7361532733",null,null,"X"]
[26011852,"AG",null,"xxxxxxxxx","xxxxxxxxx","2694000,2694025,","j.kordasiewicz@icloud.com","501 108 601","PL5242225449",null,"X","X"]
[26010997,"AG",null,"xxxxxxxxx","xxxxxxxxx","2694000,2694025,","jasiekkrzysztof@gmail.com","606 100 052",null,null,null,"X"]
[26010885,"AG",null,"xxxxxxxxx","xxxxxxxxx","2694000,2694050,","Jasiuwariat5@wp.pl","793 055 699","PL9452092152",null,null,"X"]
[26011043,"AG",null,"xxxxxxxxx","xxxxxxxxx","2694000,2694025,","janusz.gajda@konicaminolta.pl","660 749 960",null,null,null,"X"]
[26011142,"AG",null,"xxxxxxxxx","xxxxxxxxx","2694000,2694015,","Sienko@polskapress.pl",502499292,null,null,null,"X"]
[26011714,"AG",null,"xxxxxxxxx","xxxxxxxxx","2694000,2694025,","belfer2@tlen.pl",501260676,null,null,null,"X"]
[26011904,"AG",null,"xxxxxxxxx","xxxxxxxxx","2694000,2694016,","jbahrynowski@o2.pl","785 926 049",null,null,null,"X"]
[26010577,"AG",null,"xxxxxxxxx","xxxxxxxxx","2694000,2694017,","jaroslaw.kosterka@gmail.com",603301175,null,null,null,"X"]
[26011373,"AG",null,"xxxxxxxxx","xxxxxxxxx","2694000,2694016,","jaro@auto-radio.com.pl","604 580 317",null,null,null,"X"]
[26011061,"AG",null,"xxxxxxxxx","xxxxxxxxx","2694000,2694050,","wolasewicz@pzt.pl","606 439 858",null,null,null,"X"]
[26012127,"AG",null,"xxxxxxxxx","xxxxxxxxx","2694000,2694016,","jeremiaszbryg@gmail.com","+48 607 278 508","PL6572572516",null,null,"X"]
[26011412,"AG",null,"xxxxxxxxx","xxxxxxxxx","2694000,2694050,","j.hertel@tenislegia.com.pl","666 053 111",null,null,null,"X"]
[26010495,"AG",null,"xxxxxxxxx","xxxxxxxxx","2694000,2694025,","jtalik@o2.pl",608073751,null,null,null,"X"]
[26010947,"AG",null,"xxxxxxxxx","xxxxxxxxx","2694000,2694025,","adammo1111@gmail.com","502 053 162",null,null,null,"X"]
[26011029,"AG",null,"xxxxxxxxx","xxxxxxxxx","2694000,2694025,","jkubajek@noblisci.edu.pl","793 955 771",null,null,null,"X"]
[26011114,"AG",null,"xxxxxxxxx","xxxxxxxxx","2694000,2694050,","j.zakordoniec@wp.pl","600 811 100",null,null,null,"X"]
[26012049,"AG",null,"xxxxxxxxx","xxxxxxxxx","2694000,2694050,","wborowik65@gmail.com","791 477 100",null,null,null,"X"]
[26011936,"AG",null,"xxxxxxxxx","xxxxxxxxx","2694000,2694025,","gabriela-koper@wp.pl","697 915 391",null,null,null,"X"]
[26011937,"AG",null,"xxxxxxxxx","xxxxxxxxx","2694000,2694025,","julia.ogorodnik@intersport.pl",511179023,null,null,"X","X"]
[26011109,"AG",null,"xxxxxxxxx","xxxxxxxxx","2694000,2694016,","jacek.wlodar@o2.pl",606354087,null,null,null,"X"]
[26012122,"AG",null,"xxxxxxxxx","xxxxxxxxx","2694000,2694025,","jucha.sasiak@gmail.com",662093943,null,null,null,"X"]
[26011011,"AG",null,"xxxxxxxxx","xxxxxxxxx","2694000,2694025,","Jedrzej.domaszewicz@gmail.com","508 303 101",null,null,null,"X"]
[26011838,"AG",null,"xxxxxxxxx","xxxxxxxxx","2694000,2694025,","godles_83@wp.pl","663 343 708",null,null,null,"X"]
[26012017,"AG",null,"xxxxxxxxx","xxxxxxxxx","2694000,2694025,","adampajestka@tlen.pl","509 685 880","PL6342416988",null,"X","X"]
[26011686,"AG",null,"xxxxxxxxx","xxxxxxxxx","2694000,2694016,","info@sportbaza.pl",601797668,null,null,null,"X"]
[26010856,"AG",null,"xxxxxxxxx","xxxxxxxxx","2694000,2694016,","sniezkaks@poczta.onet.pl","603 389 910",null,null,null,"X"]
[26011155,"AG",null,"xxxxxxxxx","xxxxxxxxx","2694000,2694017,","michal.s.szlachta@onet.pl",660130174,"PL6793157141",null,null,"X"]
[26011627,"AG",null,"xxxxxxxxx","xxxxxxxxx","2694000,2694025,","biuro@tennisnation.pl","602 321 404",null,null,null,"X"]
[26010571,"AG",null,"xxxxxxxxx","xxxxxxxxx","2694000,2694025,","KAROLINASKOREK@GMAIL.COM","607 893 305",null,null,null,"X"]
[26011328,"AG",null,"xxxxxxxxx","xxxxxxxxx","2694000,2694016,","karolinawojtas@onet.pl","663 361 293",null,null,"X","X"]
[26011740,"AG",null,"xxxxxxxxx","xxxxxxxxx","2694000,2694025,","kasia.witos94@gmail.com",791748120,null,null,null,"X"]
[26011041,"AG",null,"xxxxxxxxx","xxxxxxxxx","2694000,2694025,","sieczny@gmail.com","536 826 856","PL9462666382",null,"X","X"]
[26011826,"AG",null,"xxxxxxxxx","xxxxxxxxx","2694000,2694016,","elita@elita.krakow.pl",602623484,null,null,null,"X"]
[26010936,"AG",null,"xxxxxxxxx","xxxxxxxxx","2694000,2694025,","malwina.dlugoszewska@interia.pl","603 848 898","PL6292412651",null,null,"X"]
[26010642,"AG",null,"xxxxxxxxx","xxxxxxxxx","2694000,2694016,","biurolive@vp.pl","601 931 846",null,null,null,"X"]
[26011569,"AG",null,"xxxxxxxxx","xxxxxxxxx","2694000,2694025,","tyma.konrad@gmail.com","884 627 220",null,null,null,"X"]
[26011326,"AG",null,"xxxxxxxxx","xxxxxxxxx","2694000,2694025,","s.anders@lesznotenisklub.pl","508 354 674","PL6972318738",null,null,"X"]
[26010207,"AG",null,"xxxxxxxxx","xxxxxxxxx","2694000,2694017,","agocman@onet.pl","501 643 742",null,null,"X","X"]
[26010109,"AG",null,"xxxxxxxxx","xxxxxxxxx","2694000,2694017,","info@krakowsport.pl",null,"PL6811641351",null,"X","X"]
[26012062,"AG",null,"xxxxxxxxx","xxxxxxxxx","2694000,2694017,","magdastochkol@gmail.com",605481244,"PL7361210461",null,null,"X"]
[26010298,"AG",null,"xxxxxxxxx","xxxxxxxxx","2694000,2694016,","holmenkol@holmenkol.pl",608532832,null,null,null,"X"]
[26010687,"AG",null,"xxxxxxxxx","xxxxxxxxx","2694000,2694025,","faktury@grzegorzecki.pl","502 905 190",null,null,"X","X"]
[26010152,"AG",null,"xxxxxxxxx","xxxxxxxxx","2694000,2694016,","dartessm@gmail.com",606928407,"PL8850003124",null,null,"X"]
[26011656,"AG",null,"xxxxxxxxx","xxxxxxxxx","2694000,2694025,","shop@x-board.pl","504 055 949","PL5422662789",null,null,"X"]
[26011343,"AG",null,"xxxxxxxxx","xxxxxxxxx","2694000,2694025,","pawelc13@o2.pl","604 962 229","PL1251621674",null,null,"X"]
[26012123,"AG",null,"xxxxxxxxx","xxxxxxxxx","2694000,2694025,","sienia1104@gmail.com",48501463793,"PL6762541482",null,null,"X"]
[26010154,"AG",null,"xxxxxxxxx","xxxxxxxxx","2694000,2694017,","kuguar.fm@poczta.fm",608384829,"PL7340039217",null,"X","X"]
[26010883,"AG",null,"xxxxxxxxx","xxxxxxxxx","2694000,2694016,","davinci@op.pl",500131400,null,null,null,"X"]
[26010881,"AG",null,"xxxxxxxxx","xxxxxxxxx","2694000,2694050,","procato@wp.pl","606 782 996",null,null,null,"X"]
[26011666,"AG",null,"xxxxxxxxx","xxxxxxxxx","2694000,2694050,","shimmki@gmail.com","+48 796 004 324",null,null,null,"X"]
[26011303,"AG",null,"xxxxxxxxx","xxxxxxxxx","2694000,2694050,","kberkieta@gmail.com","602 201 958",null,null,null,"X"]
[26011742,"AG",null,"xxxxxxxxx","xxxxxxxxx","2694000,2694025,","kamil828@poczta.fm",606672581,null,null,null,"X"]
[26011576,"AG",null,"xxxxxxxxx","xxxxxxxxx","2694000,2694016,","biuro.skiland@gmail.com","731 836 664","PL6112800134",null,"X","X"]
[26010898,"AG",null,"xxxxxxxxx","xxxxxxxxx","2694000,2694025,","monfils@vp.pl",604123760,null,null,"X","X"]
[26011655,"AG",null,"xxxxxxxxx","xxxxxxxxx","2694000,2694025,","kamilprzybitkowski@interia.pl",501513539,null,null,"X","X"]
[26011250,"AG",null,"xxxxxxxxx","xxxxxxxxx","2694000,2694050,","kama-tenis@gazeta.pl",null,null,null,null,"X"]
[26010644,"AG",null,"xxxxxxxxx","xxxxxxxxx","2694000,2694050,","BIURO@GOMET.BIZ.PL","95 728 67 47",null,null,null,"X"]
[26010690,"AG",null,"xxxxxxxxx","xxxxxxxxx","2694000,2694025,","karol.krawczynski4@gmail.com","660 430 246",null,null,null,"X"]
[26011654,"AG",null,"xxxxxxxxx","xxxxxxxxx","2694000,2694050,","karol.tenis@gmail.com",508345616,null,null,null,"X"]
[26011762,"AG",null,"xxxxxxxxx","xxxxxxxxx","2694000,2694050,","karolinagolda@o2.pl","794 041 041",null,null,null,"X"]
[26011587,"AG",null,"xxxxxxxxx","xxxxxxxxx","2694000,2694050,","mabuk98@gmail.com","533 582 825",null,null,null,"X"]
[26012002,"AG",null,"xxxxxxxxx","xxxxxxxxx","2694000,2694025,","srokakaro@gmail.com","509 788 796",null,null,null,"X"]
[26010493,"AG",null,"xxxxxxxxx","xxxxxxxxx","2694000,2694050,","karolina@karolinaszmit.com","508 870 852",null,null,null,"X"]
[26010753,"AG",null,"xxxxxxxxx","xxxxxxxxx","2694000,2694017,","k.zielinska@krsz.pl",null,null,null,null,"X"]
[26010752,"AG",null,"xxxxxxxxx","xxxxxxxxx","2694000,2694017,","k.zielinska@kancelariatemida.pl",null,null,null,null,"X"]
[26011619,"AG",null,"xxxxxxxxx","xxxxxxxxx","2694000,2694025,","kchdomanska@gmail.com","884 203 836",null,null,"X","X"]
[26010944,"AG",null,"xxxxxxxxx","xxxxxxxxx","2694000,2694050,","kasiakrlikowska@gmail.com","600 080 246",null,null,null,"X"]
[26010935,"AG",null,"xxxxxxxxx","xxxxxxxxx","2694000,2694050,","kkuzniarz@poczta.onet.pl","600 388 968",null,null,null,"X"]
[26011523,"AG",null,"xxxxxxxxx","xxxxxxxxx","2694000,2694050,","katarzyna2502@wp.pl","735 439 053",null,null,null,"X"]
[26010843,"AG",null,"xxxxxxxxx","xxxxxxxxx","2694000,2694017,","katarzyna.ostra@gmail.com",694953239,null,null,null,"X"]
[26012050,"AG",null,"xxxxxxxxx","xxxxxxxxx","2694000,2694025,","iplakos@icloud.com","732 968 110",null,null,null,"X"]
[26011325,"AG",null,"xxxxxxxxx","xxxxxxxxx","2694000,2694050,","emilkadurska@gmail.com","537 884 623",null,null,null,"X"]
[26011753,"AG",null,"xxxxxxxxx","xxxxxxxxx","2694000,2694025,","katarzynapyka1996@gmail.com",506171121,null,null,"X","X"]
[26011496,"AG",null,"xxxxxxxxx","xxxxxxxxx","2694000,2694016,","katarzyna.wasek96@gmail.com",514382651,null,null,"X","X"]
[26011381,"AG",null,"xxxxxxxxx","xxxxxxxxx","2694000,2694016,","kasia.slimak@gmail.com","791 090 008",null,null,null,"X"]
[26010581,"AG",null,"xxxxxxxxx","xxxxxxxxx","2694000,2694016,","p.drzyzgiewicz@pl.head.com","12 255 44 00",null,null,null,"X"]
[26011779,"AG",null,"xxxxxxxxx","xxxxxxxxx","2694000,2694025,","katarzynapyka1996@gmail.com",506171121,null,null,null,"X"]
[26011090,"AG",null,"xxxxxxxxx","xxxxxxxxx","2694000,2694025,","a.nadajewska@gmail.com","515 206 772",null,null,null,"X"]
[26012061,"AG",null,"xxxxxxxxx","xxxxxxxxx","2694000,2694025,","monika.rajska@wp.pl","602 665 643","PL5213065776",null,"X","X"]
[26011647,"AG",null,"xxxxxxxxx","xxxxxxxxx","2694000,2694050,","klaudyna0403@gmail.com","601 485 051",null,null,null,"X"]
[26011598,"AG",null,"xxxxxxxxx","xxxxxxxxx","2694000,2694016,","wojtekbebenek@gmail.com","603 839 409",null,null,"X","X"]
[26011224,"AG",null,"xxxxxxxxx","xxxxxxxxx","2694000,2694017,","pepe.sliwa@gmail.com",790781770,null,null,null,"X"]
[26010990,"AG",null,"xxxxxxxxx","xxxxxxxxx","2694000,2694017,","gapola@interia.pl",604499580,null,null,null,"X"]
[26010050,"AG",null,"xxxxxxxxx","xxxxxxxxx","2694000,2694016,","narty@sikret.org.pl","501-631-660",null,null,null,"X"]
[26010329,"AG",null,"xxxxxxxxx","xxxxxxxxx","2694000,2694016,","arek@klubnarciarski.wroclaw.pl","609 039 159",null,null,"X","X"]
[26012113,"AG",null,"xxxxxxxxx","xxxxxxxxx","2694000,2694017,","kasiateo1972@gmail.com",607377819,"PL6751722091",null,null,"X"]
[26010063,"AG",null,"xxxxxxxxx","xxxxxxxxx","2694000,2694016,","jan.krosny@gmail.com",605429125,null,null,null,"X"]
[26010010,"AG",null,"xxxxxxxxx","xxxxxxxxx","2694000,2694016,","biuro@klub-as.pl",509722215,null,null,null,"X"]
[26010917,"AG",null,"xxxxxxxxx","xxxxxxxxx","2694000,2694017,","azszakopane@wp.pl","18 54 24 411","PL7361048718",null,null,"X"]
[26010015,"AG",null,"xxxxxxxxx","xxxxxxxxx","2694000,2694016,","ksbeskidy@o2.pl",601798388,null,null,null,"X"]
[26011175,"AG",null,"xxxxxxxxx","xxxxxxxxx","2694000,2694017,","zagle.energetyk@gmail.com","664 115 962",null,null,null,"X"]
[26010630,"AG",null,"xxxxxxxxx","xxxxxxxxx","2694000,2694016,","pawel@dawidek.pl",660783200,null,null,null,"X"]
[26011291,"AG",null,"xxxxxxxxx","xxxxxxxxx","2694000,2694017,","biuro@frajda.zakopane.pl",604448784,null,null,null,"X"]
[26010669,"AG",null,"xxxxxxxxx","xxxxxxxxx","2694000,2694017,","tomeksadowskI@poczta.onet.pl","501 402 100",null,null,null,"X"]
[26010157,"AG",null,"xxxxxxxxx","xxxxxxxxx","2694000,2694016,","narciarnia@poczta.onet.pl",500040606,null,null,null,"X"]
[26010392,"AG",null,"xxxxxxxxx","xxxxxxxxx","2694000,2694017,","biuro@ksssm.pl","+48 608 354 154",null,null,null,"X"]
[26010792,"AG",null,"xxxxxxxxx","xxxxxxxxx","2694000,2694016,","kotomek87@gmail.com",null,null,null,null,"X"]
[26010084,"AG",null,"xxxxxxxxx","xxxxxxxxx","2694000,2694017,","yeti@yeti.org.pl",601396601,null,null,null,"X"]
[26010111,"AG",null,"xxxxxxxxx","xxxxxxxxx","2694000,2694025,","recepcja@nabloniach.com","500 210 614","PL6772245839",null,"X","X"]
[26011108,"AG",null,"xxxxxxxxx","xxxxxxxxx","2694000,2694025,","gc.ejsmont@wp.pl","602 172 685",null,null,null,"X"]
[26011143,"AG",null,"xxxxxxxxx","xxxxxxxxx","2694000,2694025,","biuro@kobemo.pl","508 144 598","PL6443167653",null,null,"X"]
[26011995,"AG",null,"xxxxxxxxx","xxxxxxxxx","2694000,2694017,","faktury@jaworzynakrynicka.pl","606 399 553","PL7341013591",null,null,"X"]
[26011896,"AG",null,"xxxxxxxxx","xxxxxxxxx","2694000,2694025,","konradciechanowicz@me.com",508965835,null,null,null,"X"]
[26010921,"AG",null,"xxxxxxxxx","xxxxxxxxx","2694000,2694016,","kong@orange.pl","506 180 286",null,null,null,"X"]
[26010775,"AG",null,"xxxxxxxxx","xxxxxxxxx","2694000,2694025,","kowalewski135@gmail.com","669 196 331",null,null,null,"X"]
[26012141,"AG",null,"xxxxxxxxx","xxxxxxxxx","2694000,2694025,","klub@ktkkrakow.pl",510831075,null,null,null,"X"]
[26011631,"AG",null,"xxxxxxxxx","xxxxxxxxx","2694000,2694025,","uks.tenis24@gmail.com","669 035 258","PL6772232251",null,"X","X"]
[26011768,"AG",null,"xxxxxxxxx","xxxxxxxxx","2694000,2694025,","krzys.malczyk@gmail.com","694 399 001",null,null,null,"X"]
[26011620,"AG",null,"xxxxxxxxx","xxxxxxxxx","2694000,2694016,","przemyslav.novak@gmail.com","+48 695996024",null,null,null,"X"]
[26010559,"AG",null,"xxxxxxxxx","xxxxxxxxx","2694000,2694016,","krzysiek.koval@gmail.com","725 115 862",null,null,null,"X"]
[26011816,"AG",null,"xxxxxxxxx","xxxxxxxxx","2694000,2694016,","krzysztofmareknarty@gmail.com",605413844,"PL9372121259",null,null,"X"]
[26011393,"AG",null,"xxxxxxxxx","xxxxxxxxx","2694000,2694016,","kp.pietkiewicz@gmail.com","601 213 557","PL6111074269",null,null,"X"]
[26010521,"AG",null,"xxxxxxxxx","xxxxxxxxx","2694000,2694015,","ksawerymalczewski@gmail.com",null,null,null,null,"X"]
[26011419,"AG",null,"xxxxxxxxx","xxxxxxxxx","2694000,2694025,","sylwia@lechiatennisclub.pl","660 570 057",null,null,null,"X"]
[26011851,"AG",null,"xxxxxxxxx","xxxxxxxxx","2694000,2694025,","michal.szewc@tenisgolf.legia.com","515 147 120","PL7010927788",null,"X","X"]
[26011158,"AG",null,"xxxxxxxxx","xxxxxxxxx","2694000,2694025,","raju@letsboard.pl",601313048,"PL7831459348",null,null,"X"]
[26010075,"AG",null,"xxxxxxxxx","xxxxxxxxx","2694000,2694016,","lksczorsztynski@gmail.com","661 920 292",null,null,null,"X"]
[26011525,"AG",null,"xxxxxxxxx","xxxxxxxxx","2694000,2694017,","tarnowkrk_axelsport@interia.pl","505 913 506","PL5170013116",null,"X","X"]
[26012056,"AG",null,"xxxxxxxxx","xxxxxxxxx","2694000,2694050,","lstradingpl@gmail.com",605545301,"PL6941579018",null,null,"X"]
[26011911,"AG",null,"xxxxxxxxx","xxxxxxxxx","2694000,2694025,","biuro@labos.com.pl",48519077275,null,null,null,"X"]
[26011623,"AG",null,"xxxxxxxxx","xxxxxxxxx","2694000,2694050,","jacek.mejer@gmail.com","600 878 000",null,null,null,"X"]
[26010966,"AG",null,"xxxxxxxxx","xxxxxxxxx","2694000,2694017,","biuro@nartyprzemysl.pl","501 798 337","PL7361719704",null,"X","X"]
[26011000,"AG",null,"xxxxxxxxx","xxxxxxxxx","2694000,2694016,","adrian.rutecki@op.pl","608 384 384","PL9511120833",null,null,"X"]
[26011945,"AG",null,"xxxxxxxxx","xxxxxxxxx","2694000,2694025,","katarzyna.hornecka@gmail.com","+48 880 055 449",null,null,null,"X"]
[26010560,"AG",null,"xxxxxxxxx","xxxxxxxxx","2694000,2694016,","leosport@o2.pl","505 064 940",null,null,null,"X"]
[26010739,"AG",null,"xxxxxxxxx","xxxxxxxxx","2694000,2694016,","leszekwykrota@yahoo.pl","601 849 191",null,null,null,"X"]
[26011533,"AG",null,"xxxxxxxxx","xxxxxxxxx","2694000,2694016,","LifeSki@vp.pl","+48 601766027",null,null,null,"X"]
[26010889,"AG",null,"xxxxxxxxx","xxxxxxxxx","2694000,2694016,","agnieszka.myszkowska@limango.pl","71 721 77 521","DE217771895",null,"X","X"]
[26010466,"AG",null,"xxxxxxxxx","xxxxxxxxx","2694000,2694017,","biuro@lukasport.pl","12 637-47-25",null,null,null,"X"]
[26011489,"AG",null,"xxxxxxxxx","xxxxxxxxx","2694000,2694025,","piotrmorag@gmail.com","660 743 311",null,null,null,"X"]
[26010941,"AG",null,"xxxxxxxxx","xxxxxxxxx","2694000,2694025,","jakub@m-active.pl","602 639 738","PL7792324347",null,null,"X"]
[26011119,"AG",null,"xxxxxxxxx","xxxxxxxxx","2694000,2694025,","biuro@m4p.pl","512 111 280",null,null,null,"X"]
[26010868,"AG",null,"xxxxxxxxx","xxxxxxxxx","2694000,2694025,","sypniewski.maciek@gmail.com",691857605,null,null,null,"X"]
[26010142,"AG",null,"xxxxxxxxx","xxxxxxxxx","2694000,2694017,","marekmajerczyk@gmail.com",601452345,"PL7361038832",null,null,"X"]
[26011812,"AG",null,"xxxxxxxxx","xxxxxxxxx","2694000,2694016,","tmajerczyk@go2.pl","603 116 430",null,null,null,"X"]
[26010271,"AG",null,"xxxxxxxxx","xxxxxxxxx","2694000,2694015,","p.bek@pl.head.com",225000831,"PL5220002860",null,"X","X"]
[26010186,"AG",null,"xxxxxxxxx","xxxxxxxxx","2694000,2694016,","plas-met@wp.eu","502 160 595",null,null,"X","X"]
[26011252,"AG",null,"xxxxxxxxx","xxxxxxxxx","2694000,2694025,","sylwia@lechiatennisclub.pl","796 921 478",null,null,null,"X"]
[26010952,"AG",null,"xxxxxxxxx","xxxxxxxxx","2694000,2694025,","mareklesiecki@o2.pl",600275742,null,null,null,"X"]
[26010736,"AG",null,"xxxxxxxxx","xxxxxxxxx","2694000,2694016,","marketour@marketour.pl",603118333,"PL8130206804",null,null,"X"]
[26010285,"AG",null,"xxxxxxxxx","xxxxxxxxx","2694000,2694016,","kontakt@marko.wroc.pl",601613268,"PL8820013804",null,"X","X"]
[26010011,"AG",null,"xxxxxxxxx","xxxxxxxxx","2694000,2694015,","zakup-efaktury@martessport.com.pl",338281767,"PL5471791682",null,"X","X"]
[26010808,"AG",null,"xxxxxxxxx","xxxxxxxxx","2694000,2694025,","tomek@mastertenis.pl","601-371-758",null,null,"X","X"]
[26010160,"AG",null,"xxxxxxxxx","xxxxxxxxx","2694000,2694017,","maxxsport@maxxsport.com.pl",501578110,"PL7352793351",null,"X","X"]
[26011400,"AG",null,"xxxxxxxxx","xxxxxxxxx","2694000,2694016,","biuro@maytur.com.pl",692076607,"PL6312276235",null,null,"X"]
[26010432,"AG",null,"xxxxxxxxx","xxxxxxxxx","2694000,2694025,","kuba.ciechalski@gmail.com",null,"PL1181923044",null,"X","X"]
[26010173,"AG",null,"xxxxxxxxx","xxxxxxxxx","2694000,2694025,","sklep@mcourt.pl",503066974,"PL6261771136",null,"X","X"]
[26011584,"AG",null,"xxxxxxxxx","xxxxxxxxx","2694000,2694017,","maciek.damski@gmail.com","+48 606 781 212",null,null,null,"X"]
[26010219,"AG",null,"xxxxxxxxx","xxxxxxxxx","2694000,2694017,","michal@zawojski.pl",606151615,"PL5521542290",null,"X","X"]
[26011946,"AG",null,"xxxxxxxxx","xxxxxxxxx","2694000,2694017,","bluescarv@wp.pl",48606644345,null,null,null,"X"]
[26011691,"AG",null,"xxxxxxxxx","xxxxxxxxx","2694000,2694025,","biuro@grand-park.pl",506387659,null,null,null,"X"]
[26010768,"AG",null,"xxxxxxxxx","xxxxxxxxx","2694000,2694016,","ksiegowa@meta-hotel.pl","795 53 16 37","PL9372513686",null,null,"X"]
[26011331,"AG",null,"xxxxxxxxx","xxxxxxxxx","2694000,2694015,","p.bek@pl.head.com",null,null,null,null,"X"]
[26010578,"AG",null,"xxxxxxxxx","xxxxxxxxx","2694000,2694025,","mgsportsklep@gmail.com","501 481 177","PL6551829619",null,null,"X"]
[26011023,"AG",null,"xxxxxxxxx","xxxxxxxxx","2694000,2694016,","mikosport1@o2.pl","602 197 327","PL8821386157",null,"X","X"]
[26011940,"AG",null,"xxxxxxxxx","xxxxxxxxx","2694000,2694017,","dpiotrek76@gmail.com","508 083 391",null,null,null,"X"]
[26011429,"AG",null,"xxxxxxxxx","xxxxxxxxx","2694000,2694016,","wojtekmitan@interia.pl",6010505469,null,null,null,"X"]
[26011077,"AG",null,"xxxxxxxxx","xxxxxxxxx","2694000,2694025,","j.marcinkowski@fairplayce.pl","606 290 800","PL7791364971",null,"X","X"]
[26010665,"AG",null,"xxxxxxxxx","xxxxxxxxx","2694000,2694015,","biuro@mjst.pl","600 800 020","PL5850000785",null,"X","X"]
[26010289,"AG",null,"xxxxxxxxx","xxxxxxxxx","2694000,2694025,","condormann@gmail.com",604458339,"PL6482516980",null,null,"X"]
[26011868,"AG",null,"xxxxxxxxx","xxxxxxxxx","2694000,2694050,","pafko@interia.pl","572 685 660",null,null,"X","X"]
[26010683,"AG",null,"xxxxxxxxx","xxxxxxxxx","2694000,2694025,","racketlonclub@gmail.com","33 815 63 93",null,null,null,"X"]
[26011304,"AG",null,"xxxxxxxxx","xxxxxxxxx","2694000,2694016,","invoice@eobuwie.com.pl","533 881 100","PL9291353356",null,"X","X"]
[26011514,"AG",null,"xxxxxxxxx","xxxxxxxxx","2694000,2694015,","mg@monckcustom.com","+48 604 944 455",null,null,"X","X"]
[26011376,"AG",null,"xxxxxxxxx","xxxxxxxxx","2694000,2694017,","sg@monckcustom.com","698 985 492",null,null,null,"X"]
[26010052,"AG",null,"xxxxxxxxx","xxxxxxxxx","2694000,2694016,","m.zagala@moresport.pl",509730213,"PL6422576085",null,null,"X"]
[26010540,"AG",null,"xxxxxxxxx","xxxxxxxxx","2694000,2694025,","tomekzuchowski@o2.pl",null,null,null,null,"X"]
[26011231,"AG",null,"xxxxxxxxx","xxxxxxxxx","2694000,2694017,","kubabc1@yahoo.com",604517313,"PL7361487441",null,"X","X"]
[26010487,"AG",null,"xxxxxxxxx","xxxxxxxxx","2694000,2694025,","sklep@mr-sport.pl","509 649 422",null,null,null,"X"]
[26010178,"AG",null,"xxxxxxxxx","xxxxxxxxx","2694000,2694025,","cyper@msport.pl",509857719,"PL6920004324",null,"X","X"]
[26011973,"AG",null,"xxxxxxxxx","xxxxxxxxx","2694000,2694025,","orlinski90@gmail.com","665 945 112",null,null,null,"X"]
[26011248,"AG",null,"xxxxxxxxx","xxxxxxxxx","2694000,2694016,","m.gaworski@skiresort.com.pl",667102828,"PL7292705046",null,null,"X"]
[26011926,"AG",null,"xxxxxxxxx","xxxxxxxxx","2694000,2694025,","michalbaranski1974@gmail.com",664498191,null,null,null,"X"]
[26010113,"AG",null,"xxxxxxxxx","xxxxxxxxx","2694000,2694025,","biuro@sportandfashion.pl",508101833,null,null,"X","X"]
[26010185,"AG",null,"xxxxxxxxx","xxxxxxxxx","2694000,2694016,","muszak@muszakski.com.pl",605546389,"PL7791965630",null,"X","X"]
[26012047,"AG",null,"xxxxxxxxx","xxxxxxxxx","2694000,2694025,","trener.adriansobczak@gmail.com","607 445 346","PL6452581091",null,null,"X"]
[26010724,"AG",null,"xxxxxxxxx","xxxxxxxxx","2694000,2694025,","m.filipiak@sportoteka.eu",516166691,null,null,null,"X"]
[26011614,"AG",null,"xxxxxxxxx","xxxxxxxxx","2694000,2694025,","marcinmikolajczak1203@gmail.com",603860246,null,null,null,"X"]
[26012138,"AG",null,"xxxxxxxxx","xxxxxxxxx","2694000,2694017,","wojtekmacheta@gmail.com",698750009,null,null,null,"X"]
[26011388,"AG",null,"xxxxxxxxx","xxxxxxxxx","2694000,2694016,","bariczek@wp.pl",697814361,null,null,null,"X"]
[26011351,"AG",null,"xxxxxxxxx","xxxxxxxxx","2694000,2694017,","bando.maciej@gmail.com","694 479898",null,null,null,"X"]
[26011912,"AG",null,"xxxxxxxxx","xxxxxxxxx","2694000,2694025,","golec.maciej@gmail.com","606 661 160",null,null,null,"X"]
[26010993,"AG",null,"xxxxxxxxx","xxxxxxxxx","2694000,2694050,","maciek.jab@wp.pl","602 638 884",null,null,null,"X"]
[26011781,"AG",null,"xxxxxxxxx","xxxxxxxxx","2694000,2694050,","bassamba2004@yahoo.de",602505015,null,null,null,"X"]
[26011365,"AG",null,"xxxxxxxxx","xxxxxxxxx","2694000,2694025,","maciej.naduk@gmail.com","603 518 797",null,null,null,"X"]
[26011595,"AG",null,"xxxxxxxxx","xxxxxxxxx","2694000,2694016,","mj.sulima@gmail.com",509873283,null,null,null,"X"]
[26010827,"AG",null,"xxxxxxxxx","xxxxxxxxx","2694000,2694025,","Sypniewski.maciek@gmail.com",691857605,null,null,null,"X"]
[26010626,"AG",null,"xxxxxxxxx","xxxxxxxxx","2694000,2694016,","m.tusiewicz@gmail.com",784909741,null,null,null,"X"]
[26011423,"AG",null,"xxxxxxxxx","xxxxxxxxx","2694000,2694025,","maciejzarebski.priv@gmail.com","601 35 25 90",null,null,null,"X"]
[26011079,"AG",null,"xxxxxxxxx","xxxxxxxxx","2694000,2694025,","mzwijacz@tesko.pl",695802627,null,null,null,"X"]
[26011137,"AG",null,"xxxxxxxxx","xxxxxxxxx","2694000,2694025,","cwiklos@tlen.pl",604947724,null,null,null,"X"]
[26010915,"AG",null,"xxxxxxxxx","xxxxxxxxx","2694000,2694017,","maciej.swirko@gmail.com","697-57-80-57",null,null,"X","X"]
[26010976,"AG",null,"xxxxxxxxx","xxxxxxxxx","2694000,2694016,","wojciech.zuchowicz@gmail.com","604 244 691",null,null,null,"X"]
[26010708,"AG",null,"xxxxxxxxx","xxxxxxxxx","2694000,2694017,","rafal.talarek@magazyntenisa.com.pl",502438163,null,null,null,"X"]
[26010756,"AG",null,"xxxxxxxxx","xxxxxxxxx","2694000,2694050,","madzia157@wp.pl","605 107 549",null,null,null,"X"]
[26012103,"AG",null,"xxxxxxxxx","xxxxxxxxx","2694000,2694050,","arybkowski@wp.pl",48601543908,null,null,null,"X"]
[26011563,"AG",null,"xxxxxxxxx","xxxxxxxxx","2694000,2694050,","msaw@o2.pl","608 032 909",null,null,null,"X"]
[26010606,"AG",null,"xxxxxxxxx","xxxxxxxxx","2694000,2694050,","mpindelska@wp.pl",null,null,null,null,"X"]
[26011312,"AG",null,"xxxxxxxxx","xxxxxxxxx","2694000,2694025,","info@majesticsport.pl","+48 503 971 122","PL9581684920",null,null,"X"]
[26010716,"AG",null,"xxxxxxxxx","xxxxxxxxx","2694000,2694050,","maksraupuk@gmail.com","696 804 235",null,null,null,"X"]
[26011808,"AG",null,"xxxxxxxxx","xxxxxxxxx","2694000,2694016,","p.dopierala@dhckancelaria.pl","603 766 270","PL7820008257",null,null,"X"]
[26011425,"AG",null,"xxxxxxxxx","xxxxxxxxx","2694000,2694025,","malwina.wojciak4@wp.pl",728877945,null,null,null,"X"]
[26011217,"AG",null,"xxxxxxxxx","xxxxxxxxx","2694000,2694016,","szkola@nakrawedzi.karpacz.pl","502 109 609","PL9531028160",null,null,"X"]
[26011699,"AG",null,"xxxxxxxxx","xxxxxxxxx","2694000,2694025,","tenis@come-on.pl","506 994 796","PL8961553939",null,"X","X"]
[26011539,"AG",null,"xxxxxxxxx","xxxxxxxxx","2694000,2694050,","mbialobrzeski@manufakturapilkarska.pl",609397129,null,null,null,"X"]
[26010994,"AG",null,"xxxxxxxxx","xxxxxxxxx","2694000,2694025,","zakupy@marba-sport.pl","58 684 99 28","PL5892027642",null,null,"X"]
[26011101,"AG",null,"xxxxxxxxx","xxxxxxxxx","2694000,2694050,","kuba@klink.pl","564-063-489",null,null,null,"X"]
[26010688,"AG",null,"xxxxxxxxx","xxxxxxxxx","2694000,2694025,","korty@korty-cyganskilas.pl",509130944,"PL6441017725",null,null,"X"]
[26011322,"AG",null,"xxxxxxxxx","xxxxxxxxx","2694000,2694050,","kisielmaniak@wp.pl","697 071 222",null,null,null,"X"]
[26011369,"AG",null,"xxxxxxxxx","xxxxxxxxx","2694000,2694025,","fizjotenis@gmail.com","694 478 571",null,null,null,"X"]
[26011693,"AG",null,"xxxxxxxxx","xxxxxxxxx","2694000,2694025,","trener2@o2.pl","503 994 796",null,null,null,"X"]
[26010901,"AG",null,"xxxxxxxxx","xxxxxxxxx","2694000,2694050,","Trener2@o2.pl",503994796,null,null,null,"X"]
[26011679,"AG",null,"xxxxxxxxx","xxxxxxxxx","2694000,2694050,","marcin.kokot@cityapartments.pl","+48 601 617 307",null,null,null,"X"]
[26010568,"AG",null,"xxxxxxxxx","xxxxxxxxx","2694000,2694025,","best1sc5@wp.pl",570257488,null,null,null,"X"]
[26011125,"AG",null,"xxxxxxxxx","xxxxxxxxx","2694000,2694025,","marcin.laszuk@interia.pl",605336131,null,null,null,"X"]
[26011364,"AG",null,"xxxxxxxxx","xxxxxxxxx","2694000,2694025,","maszczyk7@gmail.com",692483826,null,null,null,"X"]
[26011453,"AG",null,"xxxxxxxxx","xxxxxxxxx","2694000,2694050,","mynk72@gmail.com","695 102 195",null,null,null,"X"]
[26011138,"AG",null,"xxxxxxxxx","xxxxxxxxx","2694000,2694050,","pohito@ulica.pl","501 142 408",null,null,null,"X"]
[26011765,"AG",null,"xxxxxxxxx","xxxxxxxxx","2694000,2694025,",null,"789 451 330",null,null,null,"X"]
[26011459,"AG",null,"xxxxxxxxx","xxxxxxxxx","2694000,2694017,","ziolkowski.ortopedia@gmail.com",602338283,null,null,null,"X"]
[26010960,"AG",null,"xxxxxxxxx","xxxxxxxxx","2694000,2694017,","marek@tribeca.pl","695 602 766",null,null,null,"X"]
[26010391,"AG",null,"xxxxxxxxx","xxxxxxxxx","2694000,2694016,","biuro@bikesystem.pl","+48 32 424 87 50","PL6421782782",null,"X","X"]
[26011012,"AG",null,"xxxxxxxxx","xxxxxxxxx","2694000,2694050,","a.lis1970@o2.pl","668 011 726",null,null,null,"X"]
[26010891,"AG",null,"xxxxxxxxx","xxxxxxxxx","2694000,2694025,","biuro@intertenis.pl",605641332,null,null,null,"X"]
[26010169,"AG",null,"xxxxxxxxx","xxxxxxxxx","2694000,2694017,","bluescarv@wp.pl",606644345,null,null,null,"X"]
[26010553,"AG",null,"xxxxxxxxx","xxxxxxxxx","2694000,2694016,","m.walacinski@wp.pl","503 087 287",null,null,null,"X"]
[26010769,"AG",null,"xxxxxxxxx","xxxxxxxxx","2694000,2694016,","wiecek1@gmail.com",693184634,null,null,null,"X"]
[26010603,"AG",null,"xxxxxxxxx","xxxxxxxxx","2694000,2694016,","marekwolff@poczta.onet.pl",608677807,null,null,null,"X"]
[26011017,"AG",null,"xxxxxxxxx","xxxxxxxxx","2694000,2694050,","marek.wegrzyn54@gmail.com","533 189 644",null,null,null,"X"]
[26010774,"AG",null,"xxxxxxxxx","xxxxxxxxx","2694000,2694017,","majkalig@gmail.com",608457654,null,null,null,"X"]
[26010963,"AG",null,"xxxxxxxxx","xxxxxxxxx","2694000,2694016,","info@stanislawski-sport.com",792618718,null,null,null,"X"]
[26011230,"AG",null,"xxxxxxxxx","xxxxxxxxx","2694000,2694025,","p.bek@pl.head.com","600 475 559",null,null,null,"X"]
[26011219,"AG",null,"xxxxxxxxx","xxxxxxxxx","2694000,2694025,","mariooten@gmail.com",null,null,null,null,"X"]
[26011084,"AG",null,"xxxxxxxxx","xxxxxxxxx","2694000,2694017,","mariusz.bolek@wp.pl",509704383,null,null,null,"X"]
[26011626,"AG",null,"xxxxxxxxx","xxxxxxxxx","2694000,2694025,","fijalkowski.mtm@gmail.com",696028382,null,null,null,"X"]
[26011646,"AG",null,"xxxxxxxxx","xxxxxxxxx","2694000,2694025,","sportmen99@wp.pl",729488041,"PL7781078904",null,null,"X"]
[26010081,"AG",null,"xxxxxxxxx","xxxxxxxxx","2694000,2694016,","klusyhd@o2.pl",604934311,"PL7361413945",null,null,"X"]
[26010717,"AG",null,"xxxxxxxxx","xxxxxxxxx","2694000,2694025,","mariooten@gmail.com","509 743 228",null,null,null,"X"]
[26010979,"AG",null,"xxxxxxxxx","xxxxxxxxx","2694000,2694015,","m.drzyzgiewicz@pl.head.com","501 181 995",null,null,"X","X"]
[26011225,"AG",null,"xxxxxxxxx","xxxxxxxxx","2694000,2694050,","stamar@onet.pl","535 289 219",null,null,null,"X"]
[26010884,"AG",null,"xxxxxxxxx","xxxxxxxxx","2694000,2694025,","piotr@emarsport.pl","692 292 240",null,null,null,"X"]
[26011625,"AG",null,"xxxxxxxxx","xxxxxxxxx","2694000,2694050,","mgnys@poczta.onet.pl","509 527 856",null,null,null,"X"]
[26011105,"AG",null,"xxxxxxxxx","xxxxxxxxx","2694000,2694050,","mlitwin3@gazeta.pl","668 497 676",null,null,null,"X"]
[26011745,"AG",null,"xxxxxxxxx","xxxxxxxxx","2694000,2694016,","m.pilak94@gmail.com",783777394,null,null,"X","X"]
[26010757,"AG",null,"xxxxxxxxx","xxxxxxxxx","2694000,2694025,","orange.mwojciechowska@gmail.com","504 200 480",null,null,null,"X"]
[26011767,"AG",null,"xxxxxxxxx","xxxxxxxxx","2694000,2694050,","michal@piechowicz.pl","501 661 601",null,null,"X","X"]
[26011848,"AG",null,"xxxxxxxxx","xxxxxxxxx","2694000,2694017,","bartekmiejski@gmail.com","504 23 93 97","PL7343591889",null,null,"X"]
[26010718,"AG",null,"xxxxxxxxx","xxxxxxxxx","2694000,2694025,","pawel.dzikiewicz@yahoo.com",null,"PL5422857642",null,null,"X"]
[26011313,"AG",null,"xxxxxxxxx","xxxxxxxxx","2694000,2694025,","a.stepien@matchpoint.com.pl","609 999 720","PL8992602952",null,null,"X"]
[26011362,"AG",null,"xxxxxxxxx","xxxxxxxxx","2694000,2694025,","mateusz.lipinski97@gmail.com",533573555,null,null,null,"X"]
[26011846,"AG",null,"xxxxxxxxx","xxxxxxxxx","2694000,2694025,","lizak.tenis@gmail.com","511 680 008",null,null,null,"X"]
[26011780,"AG",null,"xxxxxxxxx","xxxxxxxxx","2694000,2694050,","kamilmiton@poczta.onet.pl","600 888 292",null,null,null,"X"]
[26010641,"AG",null,"xxxxxxxxx","xxxxxxxxx","2694000,2694025,","mateusz1156@onet.eu","669 213 832",null,null,null,"X"]
[26010627,"AG",null,"xxxxxxxxx","xxxxxxxxx","2694000,2694050,","zolich.mateusz@onet.pl","884 045 009",null,null,null,"X"]
[26010659,"AG",null,"xxxxxxxxx","xxxxxxxxx","2694000,2694017,","a.tabaszewska@poczta.onet.pl",null,null,null,null,"X"]
[26011591,"AG",null,"xxxxxxxxx","xxxxxxxxx","2694000,2694050,","maxsteinberger@interia.eu","661 605 720",null,null,null,"X"]
[26011968,"AG",null,"xxxxxxxxx","xxxxxxxxx","2694000,2694017,","ms@maxisport.com.pl",606141330,"PL8133307747",null,null,"X"]
[26011716,"AG",null,"xxxxxxxxx","xxxxxxxxx","2694000,2694017,","ms@maxisport.com.pl",606141330,"PL8132960209",null,null,"X"]
[26010411,"AG",null,"xxxxxxxxx","xxxxxxxxx","2694000,2694016,","mazurdarek@poczta.onet.pl",null,"PL8992174203",null,null,"X"]
[26011492,"AG",null,"xxxxxxxxx","xxxxxxxxx","2694000,2694050,","masiudak@gmail.com","602 894 598",null,null,null,"X"]
[26011162,"AG",null,"xxxxxxxxx","xxxxxxxxx","2694000,2694015,","gosia.sniegorska@gmail.com","+48 606996028",null,null,null,"X"]
[26011192,"AG",null,"xxxxxxxxx","xxxxxxxxx","2694000,2694017,","maciej.trzcinski@mozn.pl","502 220 760",null,null,null,"X"]
[26010911,"AG",null,"xxxxxxxxx","xxxxxxxxx","2694000,2694025,","biuro@tenismalopolska.pl",null,null,null,null,"X"]
[26010583,"AG",null,"xxxxxxxxx","xxxxxxxxx","2694000,2694016,","rookski@gmail.com",607262612,null,null,null,"X"]
[26010977,"AG",null,"xxxxxxxxx","xxxxxxxxx","2694000,2694016,","pawelski.m@gmail.com","888 892 672",null,null,null,"X"]
[26011273,"AG",null,"xxxxxxxxx","xxxxxxxxx","2694000,2694025,","michzarzycki@gmail.com",null,null,null,null,"X"]
[26010673,"AG",null,"xxxxxxxxx","xxxxxxxxx","2694000,2694050,","jedrzej0000@poczta.onet.pl","603 814 223",null,null,null,"X"]
[26011053,"AG",null,"xxxxxxxxx","xxxxxxxxx","2694000,2694025,","michal@buze.pl","504 048 000",null,null,null,"X"]
[26010116,"AG",null,"xxxxxxxxx","xxxxxxxxx","2694000,2694025,","michalfilipiaktenis@gmail.com",516166691,null,null,null,"X"]
[26010747,"AG",null,"xxxxxxxxx","xxxxxxxxx","2694000,2694017,","gazmirz@tlen.pl",null,null,null,null,"X"]
[26011368,"AG",null,"xxxxxxxxx","xxxxxxxxx","2694000,2694015,","goll.michal@gmail.com","501 126 166",null,null,null,"X"]
[26011827,"AG",null,"xxxxxxxxx","xxxxxxxxx","2694000,2694016,","michal.goly@wp.pl","793 703 373",null,null,null,"X"]
[26011306,"AG",null,"xxxxxxxxx","xxxxxxxxx","2694000,2694025,","michal.kostecki1@gmail.com","608 105 506",null,null,null,"X"]
[26011451,"AG",null,"xxxxxxxxx","xxxxxxxxx","2694000,2694050,","michal.kosyrz@rednetproperty.com","505 177 279",null,null,null,"X"]
[26011188,"AG",null,"xxxxxxxxx","xxxxxxxxx","2694000,2694015,","m.drzyzgiewicz@pl.head.com","+48 12 255 44 12",null,null,null,"X"]
[26010464,"AG",null,"xxxxxxxxx","xxxxxxxxx","2694000,2694015,","klusyhd@o2.pl",604934311,null,null,null,"X"]
[26011329,"AG",null,"xxxxxxxxx","xxxxxxxxx","2694000,2694050,","staltech1@gmail.com","506 938 600",null,null,null,"X"]
[26012101,"AG",null,"xxxxxxxxx","xxxxxxxxx","2694000,2694050,","m_marchewka8@wp.pl","739 078 607",null,null,null,"X"]
[26011110,"AG",null,"xxxxxxxxx","xxxxxxxxx","2694000,2694050,","michalmelon91@gmail.com","505 043 375",null,null,null,"X"]
[26010793,"AG",null,"xxxxxxxxx","xxxxxxxxx","2694000,2694025,","michal_pilch@interia.eu",511612900,null,null,null,"X"]
[26011093,"AG",null,"xxxxxxxxx","xxxxxxxxx","2694000,2694017,","michal-popiolek@wp.pl",508294128,null,null,null,"X"]
[26011115,"AG",null,"xxxxxxxxx","xxxxxxxxx","2694000,2694050,","mskonieczny102@gmail.com","506 486 218",null,null,null,"X"]
[26011129,"AG",null,"xxxxxxxxx","xxxxxxxxx","2694000,2694050,","mskonieczny102@gmail.com","506 486 218",null,null,null,"X"]
[26011361,"AG",null,"xxxxxxxxx","xxxxxxxxx","2694000,2694017,","michal.sosnowski.ms@gmail.com",null,null,null,null,"X"]
[26011027,"AG",null,"xxxxxxxxx","xxxxxxxxx","2694000,2694016,","stanislawski.ski@gmail.com",792618718,null,null,null,"X"]
[26011020,"AG",null,"xxxxxxxxx","xxxxxxxxx","2694000,2694025,","michaltor@wp.pl","506-137-117",null,null,null,"X"]
[26011683,"AG",null,"xxxxxxxxx","xxxxxxxxx","2694000,2694016,","mario127@onet.pl","606 228 488",null,null,null,"X"]
[26010958,"AG",null,"xxxxxxxxx","xxxxxxxxx","2694000,2694025,","km.mular@gmail.com","609 083 500",null,null,null,"X"]
[26010217,"AG",null,"xxxxxxxxx","xxxxxxxxx","2694000,2694017,","di_baca@vp.pl",606574807,null,null,null,"X"]
[26011733,"AG",null,"xxxxxxxxx","xxxxxxxxx","2694000,2694025,","biuro@mktstalowawola.pl","530 335 225",null,null,null,"X"]
[26011588,"AG",null,"xxxxxxxxx","xxxxxxxxx","2694000,2694025,","mikolajgola.tenis@gmail.com","794 610 202",null,null,null,"X"]
[26012004,"AG",null,"xxxxxxxxx","xxxxxxxxx","2694000,2694025,","mikolajlew@icloud.com","607 203 733",null,null,"X","X"]
[26011603,"AG",null,"xxxxxxxxx","xxxxxxxxx","2694000,2694050,","manager@silesiaclub.com","602 861 165",null,null,null,"X"]
[26011263,"AG",null,"xxxxxxxxx","xxxxxxxxx","2694000,2694050,","weymann@pzt.pl","506 010 104",null,null,null,"X"]
[26011405,"AG",null,"xxxxxxxxx","xxxxxxxxx","2694000,2694016,","jkustra@onet.eu",783296458,null,null,null,"X"]
[26011205,"AG",null,"xxxxxxxxx","xxxxxxxxx","2694000,2694017,","mirabelka@piwniczna.com","534 125 117",null,null,null,"X"]
[26010497,"AG",null,"xxxxxxxxx","xxxxxxxxx","2694000,2694016,","mirka@krajewski.pl","607 089 607",null,null,null,"X"]
[26011007,"AG",null,"xxxxxxxxx","xxxxxxxxx","2694000,2694025,","biuro@optyklechna.pl","602 360 969",null,null,null,"X"]
[26010677,"AG",null,"xxxxxxxxx","xxxxxxxxx","2694000,2694016,","wojtekmitan@interia.pl","601 505 469",null,null,null,"X"]
[26010332,"AG",null,"xxxxxxxxx","xxxxxxxxx","2694000,2694016,","mks-skrzyczne@tlen.pl",null,null,null,null,"X"]
[26011378,"AG",null,"xxxxxxxxx","xxxxxxxxx","2694000,2694016,","aniacyg@poczta.onet.pl",null,null,null,null,"X"]
[26010339,"AG",null,"xxxxxxxxx","xxxxxxxxx","2694000,2694017,","mkngorlice@gmail.com",608595612,null,null,null,"X"]
[26010051,"AG",null,"xxxxxxxxx","xxxxxxxxx","2694000,2694016,","wojciech@maleccy.com",501078982,null,null,"X","X"]
[26010013,"AG",null,"xxxxxxxxx","xxxxxxxxx","2694000,2694016,","trenerzy@mknzryw.pl",602780534,null,null,null,"X"]
[26011399,"AG",null,"xxxxxxxxx","xxxxxxxxx","2694000,2694016,","trenerzy@mknzryw.pl","+48 602 780 534",null,null,null,"X"]
[26010303,"AG",null,"xxxxxxxxx","xxxxxxxxx","2694000,2694017,","biuro@klubsmig.pl",600366686,null,null,"X","X"]
[26011618,"AG",null,"xxxxxxxxx","xxxxxxxxx","2694000,2694025,","milosz@tengo.com.pl",784085945,null,null,null,"X"]
[26010922,"AG",null,"xxxxxxxxx","xxxxxxxxx","2694000,2694025,","katarzyna.nowicka@centrumtenisa.pl","694 007 520","PL6381810614",null,"X","X"]
[26010351,"AG",null,"xxxxxxxxx","xxxxxxxxx","2694000,2694017,","maciek@mondosport.pl",608584257,"PL7343521587",null,"X","X"]
[26011921,"AG",null,"xxxxxxxxx","xxxxxxxxx","2694000,2694017,","germanska@interia.pl","604-16-89-18",null,null,null,"X"]
[26012016,"AG",null,"xxxxxxxxx","xxxxxxxxx","2694000,2694015,","monika.polchlopek94@gmail.com",698695117,null,null,null,"X"]
[26011024,"AG",null,"xxxxxxxxx","xxxxxxxxx","2694000,2694025,","kuba@monument.pl",607508608,"PL9491344758",null,null,"X"]
[26010469,"AG",null,"xxxxxxxxx","xxxxxxxxx","2694000,2694025,","irek.siwek@gmail.com",null,null,null,null,"X"]
[26011339,"AG",null,"xxxxxxxxx","xxxxxxxxx","2694000,2694016,","biuro@dolinaskrzycznego.pl",517426816,"PL5472100473",null,"X","X"]
[26011954,"AG",null,"xxxxxxxxx","xxxxxxxxx","2694000,2694017,","r.rabiasz@naferie.pl","790 322 733","PL7352863956",null,"X","X"]
[26012132,"AG",null,"xxxxxxxxx","xxxxxxxxx","2694000,2694016,","szkola@nakrawedzi.karpacz.pl",502109609,null,null,null,"X"]
[26011246,"AG",null,"xxxxxxxxx","xxxxxxxxx","2694000,2694016,","remikslawik@o2.pl",880300777,"PL8811229999",null,"X"]
[26011981,"AG",null,"xxxxxxxxx","xxxxxxxxx","2694000,2694016,","hubert@nartomaniak.pl","603 880 534","PL8862990884",null,null,"X"]
[26010451,"AG",null,"xxxxxxxxx","xxxxxxxxx","2694000,2694017,","jerkrz1@wp.pl","603 053 797",null,null,null,"X"]
[26011997,"AG",null,"xxxxxxxxx","xxxxxxxxx","2694000,2694017,","agapotocka@ndsport.pl",48504090807,null,null,"X","X"]
[26010135,"AG",null,"xxxxxxxxx","xxxxxxxxx","2694000,2694025,","netsport@netsport.com.pl",602551322,null,null,null,"X"]
[26010802,"AG",null,"xxxxxxxxx","xxxxxxxxx","2694000,2694025,","blanka.potepa@gmail.com","510 268 700","PL6792683057",null,null,"X"]
[26010875,"AG",null,"xxxxxxxxx","xxxxxxxxx","2694000,2694025,","ktwschodnia@o2.pl","512 660 743",null,null,"X","X"]
[26010866,"AG",null,"xxxxxxxxx","xxxxxxxxx","2694000,2694025,","dariusz.zajac@njntravel.pl","+48 693 461 380","PL6831940453",null,"X","X"]
[26010264,"AG",null,"xxxxxxxxx","xxxxxxxxx","2694000,2694016,","biuro@nova.szczyrk.pl",609501601,"PL5211311685",null,"X","X"]
[26010057,"AG",null,"xxxxxxxxx","xxxxxxxxx","2694000,2694025,","piotrek@novasport.pl",500530350,"PL6852286786",null,"X","X"]
[26011970,"AG",null,"xxxxxxxxx","xxxxxxxxx","2694000,2694017,","wypozyczalnia.nowobilski@gmail.com",789273633,"PL7361735117",null,null,"X"]
[26010506,"AG",null,"xxxxxxxxx","xxxxxxxxx","2694000,2694017,","serwis@superserwisntn.pl","502 575 666","PL5242763520",null,"X","X"]
[26011668,"AG",null,"xxxxxxxxx","xxxxxxxxx","2694000,2694025,","s.anders@lesznotenisklub.pl",609250900,"PL6972337641",null,"X","X"]
[26011802,"AG",null,"xxxxxxxxx","xxxxxxxxx","2694000,2694025,","dyrektor@mosir-zdunskawola.pl","693 851 275","PL8291708273",null,null,"X"]
[26011774,"AG",null,"xxxxxxxxx","xxxxxxxxx","2694000,2694017,","biuro@ukskielce.pl","792 065 545",null,null,null,"X"]
[26011550,"AG",null,"xxxxxxxxx","xxxxxxxxx","2694000,2694050,","magdalena.kostka@fenikskw.com.pl","606 765 317",null,null,null,"X"]
[26010564,"AG",null,"xxxxxxxxx","xxxxxxxxx","2694000,2694016,","stokrotk@gmail.com",693379679,null,null,null,"X"]
[26010920,"AG",null,"xxxxxxxxx","xxxxxxxxx","2694000,2694016,","stokrotk@gmail.com",693379679,"PL7352674830",null,null,"X"]
[26010934,"AG",null,"xxxxxxxxx","xxxxxxxxx","2694000,2694025,","rafal.kilijanski@gmail.com","505 369 118",null,null,"X","X"]
[26010712,"AG",null,"xxxxxxxxx","xxxxxxxxx","2694000,2694017,","maciej.sowinski@teva.pl",781481478,null,null,null,"X"]
[26012111,"AG",null,"xxxxxxxxx","xxxxxxxxx","2694000,2694017,","info@szkolajaworzyna.pl","602 148 222","PL8762481350",null,"X","X"]
[26011323,"AG",null,"xxxxxxxxx","xxxxxxxxx","2694000,2694016,","nczarnikk@gmail.com","001 917 774 7902",null,null,null,"X"]
[26011030,"AG",null,"xxxxxxxxx","xxxxxxxxx","2694000,2694025,","jkubajek@noblisci.edu.pl","793 955 771","PL9860085549",null,null,"X"]
[26010237,"AG",null,"xxxxxxxxx","xxxxxxxxx","2694000,2694016,","chachulski@interia.pl",609039159,null,null,null,"X"]
[26010330,"AG",null,"xxxxxxxxx","xxxxxxxxx","2694000,2694017,","olek@freeriders.com.pl",606611688,"PL9512159837",null,"X","X"]
[26010236,"AG",null,"xxxxxxxxx","xxxxxxxxx","2694000,2694025,","b2b@sport-shop.pl",327007440,"PL6462571817",null,"X","X"]
[26011048,"AG",null,"xxxxxxxxx","xxxxxxxxx","2694000,2694025,","norbert.palusinski@gmail.com","793 739 603",null,null,null,"X"]
[26011154,"AG",null,"xxxxxxxxx","xxxxxxxxx","2694000,2694017,","saszab13@gmail.com",505555155,null,null,null,"X"]
[26010390,"AG",null,"xxxxxxxxx","xxxxxxxxx","2694000,2694017,",null,null,null,null,null,"X"]
[26010893,"AG",null,"xxxxxxxxx","xxxxxxxxx","2694000,2694025,","winner@ostrowiec.com","604 820 910",null,null,null,"X"]
[26010316,"AG",null,"xxxxxxxxx","xxxxxxxxx","2694000,2694017,","efaktury@otcf.pl",724770150,"PL9451978451",null,"X","X"]
[26011796,"AG",null,"xxxxxxxxx","xxxxxxxxx","2694000,2694016,","szymanski.janusz@gmail.com","+48 604 093 967","PL9240010267",null,"X","X"]
[26010020,"AG",null,"xxxxxxxxx","xxxxxxxxx","2694000,2694017,","kbrzyk@interia.pl",146860820,null,null,null,"X"]
[26010725,"AG",null,"xxxxxxxxx","xxxxxxxxx","2694000,2694025,","jaroslaw_biel@interia.pl",604436924,null,null,null,"X"]
[26012019,"AG",null,"xxxxxxxxx","xxxxxxxxx","2694000,2694025,","olafrudkowski92@gmail.com",607726272,null,null,null,"X"]
[26010873,"AG",null,"xxxxxxxxx","xxxxxxxxx","2694000,2694016,","olimpia@by.onet.pl",515153553,"PL9671362195",null,null,"X"]
[26011991,"AG",null,"xxxxxxxxx","xxxxxxxxx","2694000,2694050,","magdalena.urzedowska@gmail.com","737 470 160",null,null,null,"X"]
[26010916,"AG",null,"xxxxxxxxx","xxxxxxxxx","2694000,2694050,","oszymczuch@wp.pl","600 525 456",null,null,null,"X"]
[26010538,"AG",null,"xxxxxxxxx","xxxxxxxxx","2694000,2694017,","wmartin@poczta.fm",796317593,null,null,null,"X"]
[26011170,"AG",null,"xxxxxxxxx","xxxxxxxxx","2694000,2694025,","grzegorz.jednaki@smolecsport.pl","576 09 07 00",null,null,"X","X"]
[26011134,"AG",null,"xxxxxxxxx","xxxxxxxxx","2694000,2694017,","tz@strefasport.pl",604476971,"PL8461197453",null,null,"X"]
[26011349,"AG",null,"xxxxxxxxx","xxxxxxxxx","2694000,2694025,","oskar.gorka007@gmail.com",602334850,null,null,null,"X"]
[26011552,"AG",null,"xxxxxxxxx","xxxxxxxxx","2694000,2694050,","si3winski@icloud.com",664778777,null,null,null,"X"]
[26011961,"AG",null,"xxxxxxxxx","xxxxxxxxx","2694000,2694016,","biuro@vip-ski.pl",507124829,"PL8831844199",null,"X","X"]
[26010151,"AG",null,"xxxxxxxxx","xxxxxxxxx","2694000,2694016,","ksiazek85@gmail.com",603972533,"PL8851007414",null,null,"X"]
[26010671,"AG",null,"xxxxxxxxx","xxxxxxxxx","2694000,2694025,","m.maslo81@gmail.com","693 347 468",null,null,null,"X"]
[26010732,"AG",null,"xxxxxxxxx","xxxxxxxxx","2694000,2694025,","mediaoutlet2@interia.pl","517 332 908",null,null,"X","X"]
[26010676,"AG",null,"xxxxxxxxx","xxxxxxxxx","2694000,2694025,","artsportnysamickiewicza@op.pl","602 685 955","PL7530006267",null,"X","X"]
[26011103,"AG",null,"xxxxxxxxx","xxxxxxxxx","2694000,2694025,","irekblaz@poczta.onet.pl","606 135 475","PL6351201425",null,null,"X"]
[26011424,"AG",null,"xxxxxxxxx","xxxxxxxxx","2694000,2694025,","slazik@wp.pl","607 324 707",null,null,"X","X"]
[26010048,"AG",null,"xxxxxxxxx","xxxxxxxxx","2694000,2694017,","sportland@poczta.onet.pl",602193516,"PL5860055428",null,"X","X"]
[26011671,"AG",null,"xxxxxxxxx","xxxxxxxxx","2694000,2694017,","przemyslaw@himalayasport.pl","796 216 416","PL6782997908",null,"X","X"]
[26010629,"AG",null,"xxxxxxxxx","xxxxxxxxx","2694000,2694016,","romek.w2@op.pl","600 228 326","PL9372227302",null,null,"X"]
[26010121,"AG",null,"xxxxxxxxx","xxxxxxxxx","2694000,2694016,","biuro@snowsport.pl",509240431,"PL6131289530",null,null,"X"]
[26010499,"AG",null,"xxxxxxxxx","xxxxxxxxx","2694000,2694025,","sklep@janmarsport.com","12 421 99 34",null,null,"X","X"]
[26011974,"AG",null,"xxxxxxxxx","xxxxxxxxx","2694000,2694050,","michal.jedrycha@polgast.pl",509610532,"PL6443202823",null,null,"X"]
[26011055,"AG",null,"xxxxxxxxx","xxxxxxxxx","2694000,2694016,","biuro@maytur.com.pl","606 527 608",null,null,null,"X"]
[26011191,"AG",null,"xxxxxxxxx","xxxxxxxxx","2694000,2694016,","gielda@nartypoznan.pl",604268761,"PL9720058529",null,null,"X"]
[26010146,"AG",null,"xxxxxxxxx","xxxxxxxxx","2694000,2694025,","sportplus@sportplus.pl",122740600,"PL6811453342",null,null,"X"]
[26012033,"AG",null,"xxxxxxxxx","xxxxxxxxx","2694000,2694025,","smiglo89@interia.pl","6066 79301","PL6411126071",null,"X","X"]
[26010005,"AG",null,"xxxxxxxxx","xxxxxxxxx","2694000,2694016,","tomasz.piskorz@pwantom.pl",604798776,"PL9661632339",null,null,"X"]
[26012096,"AG",null,"xxxxxxxxx","xxxxxxxxx","2694000,2694016,","biuro@pamirbike.pl","508 239 388","PL9371672098",null,null,"X"]
[26011917,"AG",null,"xxxxxxxxx","xxxxxxxxx","2694000,2694025,","pyka@papiery.com.pl",504060990,null,null,"X","X"]
[26011932,"AG",null,"xxxxxxxxx","xxxxxxxxx","2694000,2694025,","sodowa@parkwola.pl","790 030 765","PL6772440073",null,null,"X"]
[26011264,"AG",null,"xxxxxxxxx","xxxxxxxxx","2694000,2694025,","patmaj91@gmail.com","791 861 671",null,null,null,"X"]
[26010788,"AG",null,"xxxxxxxxx","xxxxxxxxx","2694000,2694025,","pawelszewczak@vp.pl",513528646,null,null,null,"X"]
[26010484,"AG",null,"xxxxxxxxx","xxxxxxxxx","2694000,2694017,","pkw2@o2.pl",783969717,null,null,null,"X"]
[26011596,"AG",null,"xxxxxxxxx","xxxxxxxxx","2694000,2694025,","piotr@tenis4u.pl","889 555 966",null,null,null,"X"]
[26011327,"AG",null,"xxxxxxxxx","xxxxxxxxx","2694000,2694025,","ciakbartosz@gmail.com","668 672 931",null,null,null,"X"]
[26011426,"AG",null,"xxxxxxxxx","xxxxxxxxx","2694000,2694025,","ciakbartosz@gmail.com",796422601,null,null,null,"X"]
[26011004,"AG",null,"xxxxxxxxx","xxxxxxxxx","2694000,2694025,","irek.siwek@gmail.com",null,"PL5252577339",null,"X","X"]
[26010201,"AG",null,"xxxxxxxxx","xxxxxxxxx","2694000,2694025,","sportcentrum@adres.pl",600325310,"PL8130001605",null,null,"X"]
[26010045,"AG",null,"xxxxxxxxx","xxxxxxxxx","2694000,2694017,","piotrjendryczka@gmail.com",665888848,"PL5832491502",null,"X","X"]
[26010666,"AG",null,"xxxxxxxxx","xxxxxxxxx","2694000,2694017,","orange.mwojciechowska@gmail.com","504 200 480",null,null,null,"X"]
[26010648,"AG",null,"xxxxxxxxx","xxxxxxxxx","2694000,2694016,","biuro@funsport.com.pl",603941200,"PL9720565060",null,"X","X"]
[26011428,"AG",null,"xxxxxxxxx","xxxxxxxxx","2694000,2694025,","biuro@pointsportclub.pl","799 155 966",null,null,"X","X"]
[26010232,"AG",null,"xxxxxxxxx","xxxxxxxxx","2694000,2694016,","jtsport@poczta.onet.pl",601752933,"PL8840006552",null,"X","X"]
[26010895,"AG",null,"xxxxxxxxx","xxxxxxxxx","2694000,2694025,","terminal.charzykowy@gmail.com",608270071,"PL5551405072",null,"X","X"]
[26010713,"AG",null,"xxxxxxxxx","xxxxxxxxx","2694000,2694025,","biuro@athleticsport.pl","68 451 75 52","PL9290117642",null,"X","X"]
[26010078,"AG",null,"xxxxxxxxx","xxxxxxxxx","2694000,2694025,","phuturysta@konin.lm.pl",632493763,"PL6650021599",null,null,"X"]
[26011857,"AG",null,"xxxxxxxxx","xxxxxxxxx","2694000,2694016,","pinki@wisla.pl","502 378 318","PL5481027913",null,null,"X"]
[26011528,"AG",null,"xxxxxxxxx","xxxxxxxxx","2694000,2694017,","a.jachymek@poczta.fm","606 317 320","PL7341057105",null,null,"X"]
[26011821,"AG",null,"xxxxxxxxx","xxxxxxxxx","2694000,2694015,","i.stachowicz@pmsport.com.pl","22 749 11 35","PL5221002164",null,null,"X"]
[26011092,"AG",null,"xxxxxxxxx","xxxxxxxxx","2694000,2694025,","piotrmorag@gmail.com","660 743 311",null,null,null,"X"]
[26011996,"AG",null,"xxxxxxxxx","xxxxxxxxx","2694000,2694016,","p.podolski@op.pl","606 266 565",null,null,null,"X"]
[26010166,"AG",null,"xxxxxxxxx","xxxxxxxxx","2694000,2694016,","jdetkos@sportpoint.pl",609388140,null,null,null,"X"]
[26010517,"AG",null,"xxxxxxxxx","xxxxxxxxx","2694000,2694016,","l.fink@head.com","609 388 140","PL6452538190",null,"X","X"]
[26010488,"AG",null,"xxxxxxxxx","xxxxxxxxx","2694000,2694016,","biuro@beskidtravel.pl",889103188,"PL5482556335",null,null,"X"]
[26011010,"AG",null,"xxxxxxxxx","xxxxxxxxx","2694000,2694016,","info@pzsn.pl","81 534 03 46",null,null,null,"X"]
[26011382,"AG",null,"xxxxxxxxx","xxxxxxxxx","2694000,2694025,","wojtek@teraztenis.pl","519 352 768","PL7781432398",null,null,"X"]
[26011939,"AG",null,"xxxxxxxxx","xxxxxxxxx","2694000,2694025,","Sebastian.Weber@unilever.com",601560360,"PL6411448886",null,null,"X"]
[26010295,"AG",null,"xxxxxxxxx","xxxxxxxxx","2694000,2694017,","robert@robis.com.pl",600333115,null,null,"X","X"]
[26011008,"AG",null,"xxxxxxxxx","xxxxxxxxx","2694000,2694025,","adam@tenisklub.pl","600 999 991",null,null,"X","X"]
[26011021,"AG",null,"xxxxxxxxx","xxxxxxxxx","2694000,2694016,","intersaks@wp.pl","501 737 662","PL9541859543",null,null,"X"]
[26010055,"AG",null,"xxxxxxxxx","xxxxxxxxx","2694000,2694025,","info@prestige-sport.pl",509098335,"PL5342047289",null,null,"X"]
[26011380,"AG",null,"xxxxxxxxx","xxxxxxxxx","2694000,2694016,","rafal@head-bikes.pl",508239109,"PL7542529539",null,null,"X"]
[26010258,"AG",null,"xxxxxxxxx","xxxxxxxxx","2694000,2694025,","tomasz.laskowski@poczta.fm",601277991,"PL9511851778",null,"X","X"]
[26010728,"AG",null,"xxxxxxxxx","xxxxxxxxx","2694000,2694016,","biuro@snowsport.pl",509240431,"PL6912398946",null,"X","X"]
[26010376,"AG",null,"xxxxxxxxx","xxxxxxxxx","2694000,2694016,","jarek@snowriders.pl",null,null,null,null,"X"]
[26010964,"AG",null,"xxxxxxxxx","xxxxxxxxx","2694000,2694025,","kontakt@profistyle.pl","731 321-441","PL6312660169",null,"X","X"]
[26010441,"AG",null,"xxxxxxxxx","xxxxxxxxx","2694000,2694025,","jacek.maciuszonek@gmail.com","509 799 288","PL9570875823",null,null,"X"]
[26010172,"AG",null,"xxxxxxxxx","xxxxxxxxx","2694000,2694017,","m.lutkowska@protenis.com.pl",502171696,"PL5212074885",null,"X","X"]
[26010034,"AG",null,"xxxxxxxxx","xxxxxxxxx","2694000,2694025,","b.kazakin@interia.pl",606933900,null,null,null,"X"]
[26011112,"AG",null,"xxxxxxxxx","xxxxxxxxx","2694000,2694025,","sport@rojax.pl","608 476 460",null,null,null,"X"]
[26011016,"AG",null,"xxxxxxxxx","xxxxxxxxx","2694000,2694025,","kancelaria@zinski.pl","606 958 630","PL9290113271",null,null,"X"]
[26011872,"AG",null,"xxxxxxxxx","xxxxxxxxx","2694000,2694025,","kontakt@padbox.pl","798 708 808","PL5892058536",null,null,"X"]
[26011190,"AG",null,"xxxxxxxxx","xxxxxxxxx","2694000,2694025,","a.grabinski@WeArePadel.com","605 044 420","PL9512428088",null,"X","X"]
[26012136,"AG",null,"xxxxxxxxx","xxxxxxxxx","2694000,2694025,","adampajestka@tlen.pl","509 685 880","PL9542837207",null,"X","X"]
[26010519,"AG",null,"xxxxxxxxx","xxxxxxxxx","2694000,2694016,","biuro@paluchsport.pl","509 111 156","PL9371524311",null,null,"X"]
[26011035,"AG",null,"xxxxxxxxx","xxxxxxxxx","2694000,2694016,","robertpanthaler@wp.pl","510 385 223","PL8861934599",null,null,"X"]
[26010661,"AG",null,"xxxxxxxxx","xxxxxxxxx","2694000,2694025,","michalfilipiaktenis@gmail.com",516166691,null,null,null,"X"]
[26012044,"AG",null,"xxxxxxxxx","xxxxxxxxx","2694000,2694025,","teclawmichal@gmail.com","512 693 499","PL7831884442",null,null,"X"]
[26010754,"AG",null,"xxxxxxxxx","xxxxxxxxx","2694000,2694016,","dunikowski.patryk@gmail.com","503 350 141",null,null,null,"X"]
[26010660,"AG",null,"xxxxxxxxx","xxxxxxxxx","2694000,2694050,","tenisista23@op.pl","697 860 697",null,null,null,"X"]
[26011747,"AG",null,"xxxxxxxxx","xxxxxxxxx","2694000,2694025,","patmaj91@gmail.com",791861671,null,null,"X","X"]
[26010505,"AG",null,"xxxxxxxxx","xxxxxxxxx","2694000,2694016,","stepienpatryk@gmail.com","601 141 495",null,null,null,"X"]
[26011869,"AG",null,"xxxxxxxxx","xxxxxxxxx","2694000,2694017,","biuro.paul@gmail.com","509 989 822",null,null,null,"X"]
[26011062,"AG",null,"xxxxxxxxx","xxxxxxxxx","2694000,2694025,","paulapaola@vp.pl","512 374 196",null,null,null,"X"]
[26010615,"AG",null,"xxxxxxxxx","xxxxxxxxx","2694000,2694025,","biuro@bws-hotele.pl",605062440,null,null,null,"X"]
[26010946,"AG",null,"xxxxxxxxx","xxxxxxxxx","2694000,2694050,","Bi-plast@bi-plast.pl","668 186 508",null,null,null,"X"]
[26010552,"AG",null,"xxxxxxxxx","xxxxxxxxx","2694000,2694015,","m.drzyzgiewicz@pl.head.com","696 432 405",null,null,"X","X"]
[26011058,"AG",null,"xxxxxxxxx","xxxxxxxxx","2694000,2694025,","pawel@adiante.home.pl","603 397 206",null,null,null,"X"]
[26011791,"AG",null,"xxxxxxxxx","xxxxxxxxx","2694000,2694017,","pawel.chyc68@gmail.com",666201042,null,null,null,"X"]
[26011166,"AG",null,"xxxxxxxxx","xxxxxxxxx","2694000,2694025,","ppawel.czepiel@gmail.com","+48 662-616-536",null,null,null,"X"]
[26010647,"AG",null,"xxxxxxxxx","xxxxxxxxx","2694000,2694050,","p.kunat@onet.pl","883 949 900",null,null,null,"X"]
[26012022,"AG",null,"xxxxxxxxx","xxxxxxxxx","2694000,2694025,","pawelpolcynpablo@gmail.com","532 548 272",null,null,null,"X"]
[26011394,"AG",null,"xxxxxxxxx","xxxxxxxxx","2694000,2694017,","pawelsyrewicz@gmail.com","601 366 288",null,null,null,"X"]
[26011132,"AG",null,"xxxxxxxxx","xxxxxxxxx","2694000,2694025,","j.stoklosa@pl.head.com","12 255 44 00","PL6791227481",null,null,"X"]
[26011353,"AG",null,"xxxxxxxxx","xxxxxxxxx","2694000,2694016,","wasekkris@poczta.onet.pl",504283142,null,null,null,"X"]
[26011688,"AG",null,"xxxxxxxxx","xxxxxxxxx","2694000,2694016,","pawel.wasek@op.pl",48501682338,null,null,null,"X"]
[26011019,"AG",null,"xxxxxxxxx","xxxxxxxxx","2694000,2694025,","sklep@peakstore.pl","+48 509 02 44 11",null,null,"X","X"]
[26011159,"AG",null,"xxxxxxxxx","xxxxxxxxx","2694000,2694016,","chopokfreeride@gmail.com","+48 733 564 743",null,null,null,"X"]
[26011036,"AG",null,"xxxxxxxxx","xxxxxxxxx","2694000,2694016,","piotrcelewicz@hotmail.com",603752242,null,null,null,"X"]
[26012072,"AG",null,"xxxxxxxxx","xxxxxxxxx","2694000,2694025,","piotr.chlebowicz@gmail.com",505012235,null,null,null,"X"]
[26012003,"AG",null,"xxxxxxxxx","xxxxxxxxx","2694000,2694025,","Piotr.hemm@gmail.com",535239060,null,null,null,"X"]
[26010812,"AG",null,"xxxxxxxxx","xxxxxxxxx","2694000,2694025,","piotrjaroos@gmail.com","694 897 024",null,null,null,"X"]
[26011706,"AG",null,"xxxxxxxxx","xxxxxxxxx","2694000,2694016,","pkalisz79@gmail.com",502256496,null,null,null,"X"]
[26011610,"AG",null,"xxxxxxxxx","xxxxxxxxx","2694000,2694025,","piotr_tennis@o2.pl",668148000,null,null,"X","X"]
[26011985,"AG",null,"xxxxxxxxx","xxxxxxxxx","2694000,2694025,","piotrek92@gmail.com",693842044,null,null,null,"X"]
[26011906,"AG",null,"xxxxxxxxx","xxxxxxxxx","2694000,2694025,","pm@wealthoncf.pl","512 817 852","PL5252630068",null,"X","X"]
[26010959,"AG",null,"xxxxxxxxx","xxxxxxxxx","2694000,2694050,","Piotr.monka@yumatech.pl","693 691 755",null,null,null,"X"]
[26010686,"AG",null,"xxxxxxxxx","xxxxxxxxx","2694000,2694017,","piotr.ochwat@gmail.com",607245267,null,null,null,"X"]
[26010972,"AG",null,"xxxxxxxxx","xxxxxxxxx","2694000,2694050,","postaszkiewicz@interia.pl","723 680 139",null,null,null,"X"]
[26012091,"AG",null,"xxxxxxxxx","xxxxxxxxx","2694000,2694017,","piotr@narciarskiexpert.pl","785 111 205","PL6782884736",null,null,"X"]
[26010580,"AG",null,"xxxxxxxxx","xxxxxxxxx","2694000,2694016,","Palczewski.piotrek@gmail.com",506000138,null,null,null,"X"]
[26011734,"AG",null,"xxxxxxxxx","xxxxxxxxx","2694000,2694025,","biuro@padeld8.com",608415074,null,null,null,"X"]
[26011384,"AG",null,"xxxxxxxxx","xxxxxxxxx","2694000,2694050,","piotr.tomanski@gmail.com","500 050 020",null,null,null,"X"]
[26010573,"AG",null,"xxxxxxxxx","xxxxxxxxx","2694000,2694025,","piotr.laguna@gmail.com",null,null,null,null,"X"]
[26011416,"AG",null,"xxxxxxxxx","xxxxxxxxx","2694000,2694050,","zurawiecki@pzt.pl","602 600 531",null,null,null,"X"]
[26010042,"AG",null,"xxxxxxxxx","xxxxxxxxx","2694000,2694016,","biuro@vip-ski.pl",507124829,"PL8831561194",null,"X","X"]
[26011817,"AG",null,"xxxxxxxxx","xxxxxxxxx","2694000,2694025,","Piotr.dobrzynski@plastline.com.pl",601586529,"PL8990103593",null,null,"X"]
[26010091,"AG",null,"xxxxxxxxx","xxxxxxxxx","2694000,2694025,","artur.piwowar@playerone.pl",504093316,"PL6772343393",null,null,"X"]
[26011652,"AG",null,"xxxxxxxxx","xxxxxxxxx","2694000,2694017,","bartolomej@poczta.onet.pl","689 118 14 59",null,null,null,"X"]
[26010711,"AG",null,"xxxxxxxxx","xxxxxxxxx","2694000,2694016,","jmarcinkowski@gasket.com.pl","604 902 956","PL9691501205",null,null,"X"]
[26010614,"AG",null,"xxxxxxxxx","xxxxxxxxx","2694000,2694025,","csir@pk.edu.pl",null,"PL6750006257",null,null,"X"]
[26010367,"AG",null,"xxxxxxxxx","xxxxxxxxx","2694000,2694016,","askapachole@gmail.com",695933169,"PL6310200736",null,null,"X"]
[26010412,"AG",null,"xxxxxxxxx","xxxxxxxxx","2694000,2694016,","b.sojka@paralympic.org.pl",601396145,null,null,null,"X"]
[26010328,"AG",null,"xxxxxxxxx","xxxxxxxxx","2694000,2694025,","redakcja@polski-tenis.pl",null,null,null,null,"X"]
[26010248,"AG",null,"xxxxxxxxx","xxxxxxxxx","2694000,2694016,","bartosz.sojka@pzsnstart.eu",570570738,null,null,null,"X"]
[26011581,"AG",null,"xxxxxxxxx","xxxxxxxxx","2694000,2694025,","biuro@polskisquash.pl","669 615 815",null,null,null,"X"]
[26010437,"AG",null,"xxxxxxxxx","xxxxxxxxx","2694000,2694025,","kowalska@pzt.pl",null,"PL5262170384",null,null,"X"]
[26012109,"AG",null,"xxxxxxxxx","xxxxxxxxx","2694000,2694017,","faktury@pkl.pl","+48 722 007 215","PL7361716338",null,null,"X"]
[26010382,"AG",null,"xxxxxxxxx","xxxxxxxxx","2694000,2694017,","Krzysiek@potwory.com",663380636,"PL5213584967",null,null,"X"]
[26010401,"AG",null,"xxxxxxxxx","xxxxxxxxx","2694000,2694016,","zsnslalom@poczta.onet.pl","608-168-031","PL6481082605",null,"X","X"]
[26011374,"AG",null,"xxxxxxxxx","xxxxxxxxx","2694000,2694016,","bienkowskigs@gmail.com","502 737 279",null,null,"X","X"]
[26011678,"AG",null,"xxxxxxxxx","xxxxxxxxx","2694000,2694016,","ski.sudety@gmail.com",663369143,"PL6112584185",null,"X","X"]
[26010471,"AG",null,"xxxxxxxxx","xxxxxxxxx","2694000,2694025,","prince-sport@go2.pl","604 770 797","PL8941239430",null,"X","X"]
[26011247,"AG",null,"xxxxxxxxx","xxxxxxxxx","2694000,2694025,","rkt.raciborz@onet.pl",null,null,null,null,"X"]
[26011615,"AG",null,"xxxxxxxxx","xxxxxxxxx","2694000,2694025,","lukasz.piasecki@mycenter.pl","668 254 244",null,null,null,"X"]
[26010067,"AG",null,"xxxxxxxxx","xxxxxxxxx","2694000,2694016,","biuro@profisport.com.pl",697852693,"PL6452162603",null,null,"X"]
[26011088,"AG",null,"xxxxxxxxx","xxxxxxxxx","2694000,2694025,","lange@profit.hofmann.pl",null,"PL7791191559",null,"X","X"]
[26011073,"AG",null,"xxxxxxxxx","xxxxxxxxx","2694000,2694016,","psowizral@progenis.pl","606 212 802","PL6762245720",null,null,"X"]
[26011111,"AG",null,"xxxxxxxxx","xxxxxxxxx","2694000,2694025,","hubert.paszkowski@gmail.com",512210945,null,null,null,"X"]
[26010518,"AG",null,"xxxxxxxxx","xxxxxxxxx","2694000,2694050,","pgadomski@vp.pl",null,null,null,null,"X"]
[26011139,"AG",null,"xxxxxxxxx","xxxxxxxxx","2694000,2694025,","trip@silesiatrip.pl",null,null,null,null,"X"]
[26010225,"AG",null,"xxxxxxxxx","xxxxxxxxx","2694000,2694025,","gieczysz@interia.pl",604794987,null,null,null,"X"]
[26010025,"AG",null,"xxxxxxxxx","xxxxxxxxx","2694000,2694025,","sport@paak.com.pl",502637574,"PL5540090995",null,"X","X"]
[26010454,"AG",null,"xxxxxxxxx","xxxxxxxxx","2694000,2694025,","bozena@sopolinski.pl",509724881,"PL9111102760",null,null,"X"]
[26010475,"AG",null,"xxxxxxxxx","xxxxxxxxx","2694000,2694025,","michalbieniusa-1989@o2.pl","500 374 896",null,null,null,"X"]
[26010612,"AG",null,"xxxxxxxxx","xxxxxxxxx","2694000,2694016,","wiszu1@o2.pl","604 853 412",null,null,null,"X"]
[26011434,"AG",null,"xxxxxxxxx","xxxxxxxxx","2694000,2694025,","michalsekula88@gmail.com","501 614 858","PL7342865617",null,"X","X"]
[26010448,"AG",null,"xxxxxxxxx","xxxxxxxxx","2694000,2694025,","funtomtenis@gmail.com",507959554,null,null,null,"X"]
[26011814,"AG",null,"xxxxxxxxx","xxxxxxxxx","2694000,2694016,","frente68@op.pl",504102979,"PL5482477794",null,"X","X"]
[26010428,"AG",null,"xxxxxxxxx","xxxxxxxxx","2694000,2694016,","bujokprzemyslaw@gmail.com","+48 507 705 000","PL5482401058",null,"X","X"]
[26010557,"AG",null,"xxxxxxxxx","xxxxxxxxx","2694000,2694025,","pgodek@gmail.com","604 931 883",null,null,null,"X"]
[26011632,"AG",null,"xxxxxxxxx","xxxxxxxxx","2694000,2694025,","przemek_jak@o2.pl",504194730,null,null,null,"X"]
[26011354,"AG",null,"xxxxxxxxx","xxxxxxxxx","2694000,2694016,","pmastalerz@olma.com.pl",694412423,null,null,"X","X"]
[26011177,"AG",null,"xxxxxxxxx","xxxxxxxxx","2694000,2694025,","aga@systemyzegarowe.pl","730 500 963","PL7661817865",null,null,"X"]
[26011987,"AG",null,"xxxxxxxxx","xxxxxxxxx","2694000,2694016,","kontakt@skiss.pl","881 75 20 20",null,null,null,"X"]
[26010737,"AG",null,"xxxxxxxxx","xxxxxxxxx","2694000,2694017,","info@qbasport.pl",null,"PL5841377119",null,"X","X"]
[26010044,"AG",null,"xxxxxxxxx","xxxxxxxxx","2694000,2694016,","info@qbasport.pl",535774409,null,null,"X","X"]
[26010238,"AG",null,"xxxxxxxxx","xxxxxxxxx","2694000,2694016,","info@qbl-systems.com",507017725,"PL5482074820",null,"X","X"]
[26010857,"AG",null,"xxxxxxxxx","xxxxxxxxx","2694000,2694016,","skipointszklarska@gmail.com","668 409 242","PL6421216338",null,"X","X"]
[26010544,"AG",null,"xxxxxxxxx","xxxxxxxxx","2694000,2694025,","Marcin.Klosowski@R-GOL.com",509555405,"PL7411557251",null,"X","X"]
[26011359,"AG",null,"xxxxxxxxx","xxxxxxxxx","2694000,2694025,","radekgrze@onet.eu",690670658,null,null,"X","X"]
[26011207,"AG",null,"xxxxxxxxx","xxxxxxxxx","2694000,2694016,","nartywroclaw@op.pl","603 253 153","PL8971686808",null,null,"X"]
[26011427,"AG",null,"xxxxxxxxx","xxxxxxxxx","2694000,2694025,","mateusz.wicher@squashok.pl","512 080 534","PL9542792918",null,"X","X"]
[26010871,"AG",null,"xxxxxxxxx","xxxxxxxxx","2694000,2694025,","biuro@activetenis.com.pl","607-241-090",null,null,null,"X"]
[26011317,"AG",null,"xxxxxxxxx","xxxxxxxxx","2694000,2694025,","office@reform.pl","501 127 337","PL7282505268",null,"X","X"]
[26011549,"AG",null,"xxxxxxxxx","xxxxxxxxx","2694000,2694016,","cebulatom@o2.pl","504 215 150","PL6141299205",null,null,"X"]
[26010141,"AG",null,"xxxxxxxxx","xxxxxxxxx","2694000,2694025,","sklep@sportx.pl",501508698,"PL7421048249",null,null,"X"]
[26011559,"AG",null,"xxxxxxxxx","xxxxxxxxx","2694000,2694017,","rhsport@rhsport.pl","660 276 078","PL5271076839",null,null,"X"]
[26010706,"AG",null,"xxxxxxxxx","xxxxxxxxx","2694000,2694025,","cpo.zarzad@o2.pl",784045173,"PL5992398059",null,null,"X"]
[26010163,"AG",null,"xxxxxxxxx","xxxxxxxxx","2694000,2694025,","rpsport@wp.pl",603065819,null,null,null,"X"]
[26011744,"AG",null,"xxxxxxxxx","xxxxxxxxx","2694000,2694025,","marta@ruszsiedzieciaku.pl","606 833 047",null,null,null,"X"]
[26011811,"AG",null,"xxxxxxxxx","xxxxxxxxx","2694000,2694025,","rkt.raciborz@onet.pl","698 622 434",null,null,null,"X"]
[26010092,"AG",null,"xxxxxxxxx","xxxxxxxxx","2694000,2694025,","racquet@racquet.pl",694463021,"PL6792995609",null,null,"X"]
[26010937,"AG",null,"xxxxxxxxx","xxxxxxxxx","2694000,2694025,","kotradek@op.pl","502 183 168",null,null,null,"X"]
[26012043,"AG",null,"xxxxxxxxx","xxxxxxxxx","2694000,2694016,","rafal.lisak@gmail.com","883 842 568",null,null,"X","X"]
[26011128,"AG",null,"xxxxxxxxx","xxxxxxxxx","2694000,2694025,","rafalmalczewski@poczta.onet.pl",600320443,null,null,null,"X"]
[26011141,"AG",null,"xxxxxxxxx","xxxxxxxxx","2694000,2694050,","RAFAL@NEUROHM.COM",601163993,null,null,null,"X"]
[26011636,"AG",null,"xxxxxxxxx","xxxxxxxxx","2694000,2694025,","rafal_rutkowski@onet.pl","516 527 969",null,null,null,"X"]
[26011220,"AG",null,"xxxxxxxxx","xxxxxxxxx","2694000,2694016,","rafcio.sz@interia.pl","798 808 366","PL8871087008",null,"X","X"]
[26010978,"AG",null,"xxxxxxxxx","xxxxxxxxx","2694000,2694015,","Rafal.Wojnowski@pekao.com.pl","691 899 525",null,null,null,"X"]
[26011784,"AG",null,"xxxxxxxxx","xxxxxxxxx","2694000,2694016,","roman@rajbiski.szczyrk.pl","502 311 301","PL9371372692",null,"X","X"]
[26011167,"AG",null,"xxxxxxxxx","xxxxxxxxx","2694000,2694016,","ski@rajbit.pl","502 310 200","PL9372251507",null,null,"X"]
[26010653,"AG",null,"xxxxxxxxx","xxxxxxxxx","2694000,2694025,","rethajacobs@gmail.com",null,null,null,null,"X"]
[26011977,"AG",null,"xxxxxxxxx","xxxxxxxxx","2694000,2694016,","biuro@raszkasport.pl","603 095 710","PL5482645760",null,null,"X"]
[26010423,"AG",null,"xxxxxxxxx","xxxxxxxxx","2694000,2694017,","r.rozanski@rebelmedia.pl","600 007 796","PL5213641748",null,null,"X"]
[26010623,"AG",null,"xxxxxxxxx","xxxxxxxxx","2694000,2694017,","p.drzyzgiewicz@pl.head.com",null,"PL5261012714",null,null,"X"]
[26010275,"AG",null,"xxxxxxxxx","xxxxxxxxx","2694000,2694025,","rp@redeco.pl",502611010,"PL8942660858",null,null,"X"]
[26012126,"AG",null,"xxxxxxxxx","xxxxxxxxx","2694000,2694016,","tomekcison@wp.pl","604 500 608","PL7342900710",null,null,"X"]
[26010638,"AG",null,"xxxxxxxxx","xxxxxxxxx","2694000,2694025,","rethajacobs@gmail.com","889 628 438",null,null,null,"X"]
[26011558,"AG",null,"xxxxxxxxx","xxxxxxxxx","2694000,2694050,","robert.bojarski0709@gmail.com","602 624 624",null,null,null,"X"]
[26011982,"AG",null,"xxxxxxxxx","xxxxxxxxx","2694000,2694016,","lalus78@interia.pl",519814600,"PL8831597789",null,"X","X"]
[26010643,"AG",null,"xxxxxxxxx","xxxxxxxxx","2694000,2694050,","Robert@chsukces.pl","509 398 836",null,null,null,"X"]
[26011385,"AG",null,"xxxxxxxxx","xxxxxxxxx","2694000,2694050,","salamk@wp.pl","500 805 725",null,null,null,"X"]
[26010161,"AG",null,"xxxxxxxxx","xxxxxxxxx","2694000,2694025,","biuro@ltcteam.pl",601350643,null,null,null,"X"]
[26010765,"AG",null,"xxxxxxxxx","xxxxxxxxx","2694000,2694017,","makowski.poczta@wp.pl","508 158 196",null,null,null,"X"]
[26010897,"AG",null,"xxxxxxxxx","xxxxxxxxx","2694000,2694050,","robert_mikula@pern.com.pl","600 437 644",null,null,null,"X"]
[26010738,"AG",null,"xxxxxxxxx","xxxxxxxxx","2694000,2694025,","tld@tld.com.pl",null,null,null,null,"X"]
[26011292,"AG",null,"xxxxxxxxx","xxxxxxxxx","2694000,2694025,","Robert@britishschool.pl","603 937 293","PL7391231479",null,null,"X"]
[26012071,"AG",null,"xxxxxxxxx","xxxxxxxxx","2694000,2694050,","szila@outlook.com","606 605 551",null,null,null,"X"]
[26010447,"AG",null,"xxxxxxxxx","xxxxxxxxx","2694000,2694025,","zbigniew@sanowski.pl","508 325 733",null,null,null,"X"]
[26010563,"AG",null,"xxxxxxxxx","xxxxxxxxx","2694000,2694016,","romanchodzba@gmail.com","663 903 610",null,null,null,"X"]
[26010640,"AG",null,"xxxxxxxxx","xxxxxxxxx","2694000,2694050,","lange@profit.hofmann.pl",508242459,null,null,null,"X"]
[26011712,"AG",null,"xxxxxxxxx","xxxxxxxxx","2694000,2694025,","tukszdun@gmail.com","693 851 275",null,null,null,"X"]
[26010657,"AG",null,"xxxxxxxxx","xxxxxxxxx","2694000,2694025,","tukszdun@gmail.com","693 851 275",null,null,null,"X"]
[26011751,"AG",null,"xxxxxxxxx","xxxxxxxxx","2694000,2694050,","tenisistkarozi2016@gmail.com","666 147 779",null,null,null,"X"]
[26010442,"AG",null,"xxxxxxxxx","xxxxxxxxx","2694000,2694025,","kamil88rybak@gmail.com","691 332 003",null,null,"X","X"]
[26011782,"AG",null,"xxxxxxxxx","xxxxxxxxx","2694000,2694025,","piasecki.qm@gmail.com","668 254 244","PL6452571336",null,null,"X"]
[26012129,"AG",null,"xxxxxxxxx","xxxxxxxxx","2694000,2694025,","kinga.grudzien-olejniczak@sportofino.com","+48 783 660 000","PL7792446406",null,null,"X"]
[26010968,"AG",null,"xxxxxxxxx","xxxxxxxxx","2694000,2694025,","a.wygoda@wygodatravel.pl","12 252 09 10",null,null,null,"X"]
[26011352,"AG",null,"xxxxxxxxx","xxxxxxxxx","2694000,2694017,","kontakt@saysport.pl","664 362 152","PL6791804056",null,"X","X"]
[26011497,"AG",null,"xxxxxxxxx","xxxxxxxxx","2694000,2694016,","snowflake@snowflake.pl","693 756 256","PL1182198941",null,null,"X"]
[26010456,"AG",null,"xxxxxxxxx","xxxxxxxxx","2694000,2694025,","biuro@sidorsport.pl","502 623 751",null,null,"X","X"]
[26010721,"AG",null,"xxxxxxxxx","xxxxxxxxx","2694000,2694016,","kamilwitor@interia.pl","502 116 331","PL6342483743",null,null,"X"]
[26011040,"AG",null,"xxxxxxxxx","xxxxxxxxx","2694000,2694016,","info@ski-planet.pl","+ 48 717254068","PL9730867615",null,"X","X"]
[26011124,"AG",null,"xxxxxxxxx","xxxxxxxxx","2694000,2694017,","dzialhandlowy@skiteam.pl",666074307,"PL5223004888",null,"X","X"]
[26011421,"AG",null,"xxxxxxxxx","xxxxxxxxx","2694000,2694016,","biuro@skitomo.pl","508 934 944",null,null,null,"X"]
[26011208,"AG",null,"xxxxxxxxx","xxxxxxxxx","2694000,2694016,","skibikesport@gmail.com","668 815 726","PL6312581903",null,"X","X"]
[26010419,"AG",null,"xxxxxxxxx","xxxxxxxxx","2694000,2694017,","skipark@onet.pl",609126798,"PL5271714820",null,"X","X"]
[26011409,"AG",null,"xxxxxxxxx","xxxxxxxxx","2694000,2694016,","wklis05@gmail.com",660883495,null,null,"X","X"]
[26011047,"AG",null,"xxxxxxxxx","xxxxxxxxx","2694000,2694017,","dpiotrek76@gmail.com","508 083 391",null,null,null,"X"]
[26010106,"AG",null,"xxxxxxxxx","xxxxxxxxx","2694000,2694017,","sklep@nartykrakow.pl",511050050,"PL6792474419",null,"X","X"]
[26010318,"AG",null,"xxxxxxxxx","xxxxxxxxx","2694000,2694017,","pemi@op.pl",604284243,"PL6331958875",null,null,"X"]
[26012031,"AG",null,"xxxxxxxxx","xxxxxxxxx","2694000,2694025,","michalnispon@gmail.com",691019983,null,null,"X","X"]
[26010012,"AG",null,"xxxxxxxxx","xxxxxxxxx","2694000,2694016,","ski.sport@vp.pl",506566000,"PL5470287964",null,"X","X"]
[26010062,"AG",null,"xxxxxxxxx","xxxxxxxxx","2694000,2694016,","narty@wakor.pl",501090139,"PL6112216429",null,null,"X"]
[26010001,"AG",null,"xxxxxxxxx","xxxxxxxxx","2694000,2694016,","sklepbiwak@interia.pl",509661005,"PL7691000502",null,null,"X"]
[26011013,"AG",null,"xxxxxxxxx","xxxxxxxxx","2694000,2694016,","k2sport@op.pl",662260632,"PL6112163963",null,null,"X"]
[26010311,"AG",null,"xxxxxxxxx","xxxxxxxxx","2694000,2694025,","sklep@roweromania.pl",134634212,"PL6871352202",null,null,"X"]
[26010104,"AG",null,"xxxxxxxxx","xxxxxxxxx","2694000,2694016,","skiteam@wp.pl",601082768,null,null,null,"X"]
[26010203,"AG",null,"xxxxxxxxx","xxxxxxxxx","2694000,2694025,","sgulina@sk-sport.pl",790864800,"PL8133616626",null,"X","X"]
[26010565,"AG",null,"xxxxxxxxx","xxxxxxxxx","2694000,2694050,","j.hertel@tenislegia.com.pl",null,null,null,null,"X"]
[26011396,"AG",null,"xxxxxxxxx","xxxxxxxxx","2694000,2694017,","dzielna@skladsportowy.pl",226363642,"PL5272387493",null,"X","X"]
[26010417,"AG",null,"xxxxxxxxx","xxxxxxxxx","2694000,2694017,","maciej.stasiak@smjsport.pl","601 263 783","PL1180037553",null,"X","X"]
[26010601,"AG",null,"xxxxxxxxx","xxxxxxxxx","2694000,2694016,","kontakt@snowreligion.com",null,null,null,null,"X"]
[26010384,"AG",null,"xxxxxxxxx","xxxxxxxxx","2694000,2694016,","elita@elita.krakow.pl",501472788,null,null,null,"X"]
[26011006,"AG",null,"xxxxxxxxx","xxxxxxxxx","2694000,2694025,","soldi@solditenis.pl",502598424,null,null,"X","X"]
[26011229,"AG",null,"xxxxxxxxx","xxxxxxxxx","2694000,2694025,","sportandsmile@gmail.com","602 334 850",null,null,null,"X"]
[26010074,"AG",null,"xxxxxxxxx","xxxxxxxxx","2694000,2694025,","lukiswist@tlen.pl",505006750,null,null,null,"X"]
[26011265,"AG",null,"xxxxxxxxx","xxxxxxxxx","2694000,2694025,","monfils@vp.pl","604 123 760",null,null,null,"X"]
[26010223,"AG",null,"xxxxxxxxx","xxxxxxxxx","2694000,2694016,","dostawy@sportclub.com.pl",918362070,"PL8522473374",null,"X","X"]
[26010888,"AG",null,"xxxxxxxxx","xxxxxxxxx","2694000,2694025,","biuro@sporthalls.pl","668 123 528","PL8992712267",null,"X","X"]
[26010162,"AG",null,"xxxxxxxxx","xxxxxxxxx","2694000,2694017,","yajacek@gmail.com","603 747 987","PL7390009810",null,"X","X"]
[26011147,"AG",null,"xxxxxxxxx","xxxxxxxxx","2694000,2694016,","krzysztofk75@op.pl","692 438 131","PL9372191981",null,"X","X"]
[26010251,"AG",null,"xxxxxxxxx","xxxxxxxxx","2694000,2694017,","sklep@nartywarszawa.pl",502295085,"PL1230559823",null,"X","X"]
[26011375,"AG",null,"xxxxxxxxx","xxxxxxxxx","2694000,2694025,","maciejdudzik123@gmail.com","512 285 101",null,null,null,"X"]
[26010301,"AG",null,"xxxxxxxxx","xxxxxxxxx","2694000,2694017,","bartlomiejwadrzyk76@gmail.com",604788254,"PL5850203198",null,null,"X"]
[26010214,"AG",null,"xxxxxxxxx","xxxxxxxxx","2694000,2694025,","info@sportshop.pl",585507733,"PL5850203198",null,"X","X"]
[26010149,"AG",null,"xxxxxxxxx","xxxxxxxxx","2694000,2694017,","sportszok@sportszok.pl",603409267,null,null,"X","X"]
[26011828,"AG",null,"xxxxxxxxx","xxxxxxxxx","2694000,2694016,","kbarczak@sporting.com.pl","691 914 660","PL6971052592",null,null,"X"]
[26011748,"AG",null,"xxxxxxxxx","xxxxxxxxx","2694000,2694015,","towarowe@sportano.pl","571 553 829","PL9731077223",null,"X","X"]
[26010179,"AG",null,"xxxxxxxxx","xxxxxxxxx","2694000,2694025,","sportech@sportech.pl",501364726,"PL7831009119",null,"X","X"]
[26010263,"AG",null,"xxxxxxxxx","xxxxxxxxx","2694000,2694017,","igor@sporteum.pl",605165501,null,null,null,"X"]
[26010569,"AG",null,"xxxxxxxxx","xxxxxxxxx","2694000,2694016,","przemyslawolma@esportmaster.pl","500 263 530","PL9372603834",null,"X","X"]
[26011148,"AG",null,"xxxxxxxxx","xxxxxxxxx","2694000,2694017,","sportownia.katowice@gmail.com",602516067,"PL6342905813",null,"X","X"]
[26010422,"AG",null,"xxxxxxxxx","xxxxxxxxx","2694000,2694025,","centrumteam@centrumteam.pl","0048 52 375 5...",null,null,null,"X"]
[26010068,"AG",null,"xxxxxxxxx","xxxxxxxxx","2694000,2694016,","infosportsmen@gmail.com",666993997,null,null,"X","X"]
[26010461,"AG",null,"xxxxxxxxx","xxxxxxxxx","2694000,2694025,","info@sportsystem.pl",null,null,null,null,"X"]
[26012007,"AG",null,"xxxxxxxxx","xxxxxxxxx","2694000,2694025,","janusz.hentosz@gmail.com","502 589 713","PL5262552938",null,"X","X"]
[26010125,"AG",null,"xxxxxxxxx","xxxxxxxxx","2694000,2694017,","stansport@wp.pl",608094959,"PL7371669735",null,null,"X"]
[26010576,"AG",null,"xxxxxxxxx","xxxxxxxxx","2694000,2694017,","gstaron@wp.pl",null,"PL5252486186",null,null,"X"]
[26011665,"AG",null,"xxxxxxxxx","xxxxxxxxx","2694000,2694025,","p.grela@wp.pl","603 508 309",null,null,"X","X"]
[26010140,"AG",null,"xxxxxxxxx","xxxxxxxxx","2694000,2694017,","sonik@stosport.pl",605071700,"PL9442223612",null,null,"X"]
[26011613,"AG",null,"xxxxxxxxx","xxxxxxxxx","2694000,2694050,","Przemek.siewinski@sportclub.com.pl","604 758 844",null,null,null,"X"]
[26010089,"AG",null,"xxxxxxxxx","xxxxxxxxx","2694000,2694050,","biuro@sitn.pl",601970426,"PL6771088007",null,null,"X"]
[26011589,"AG",null,"xxxxxxxxx","xxxxxxxxx","2694000,2694025,","hubert.paszkowski@cpinvestment.pl","512 210 945",null,null,null,"X"]
[26012142,"AG",null,"xxxxxxxxx","xxxxxxxxx","2694000,2694016,","info@skfpartner.poznan.pl","061 878 22 40",null,null,null,"X"]
[26011075,"AG",null,"xxxxxxxxx","xxxxxxxxx","2694000,2694025,","lukasz.piasecki@mycenter.pl","668 254 244",null,null,null,"X"]
[26011850,"AG",null,"xxxxxxxxx","xxxxxxxxx","2694000,2694025,","biuro@silesiapadel.pl","602 584 770",null,null,"X","X"]
[26011801,"AG",null,"xxxxxxxxx","xxxxxxxxx","2694000,2694017,","strama@nosal.pl",501645427,"PL7361737323",null,null,"X"]
[26010293,"AG",null,"xxxxxxxxx","xxxxxxxxx","2694000,2694017,","strama@nosal.pl",501645427,"PL7361737323",null,null,"X"]
[26011786,"AG",null,"xxxxxxxxx","xxxxxxxxx","2694000,2694017,","strama@nosal.pl",501645427,"PL7361737323",null,null,"X"]
[26010733,"AG",null,"xxxxxxxxx","xxxxxxxxx","2694000,2694025,","marek.wojnarski@gmail.com","880 048 675","PL7481506514",null,"X","X"]
[26012128,"AG",null,"xxxxxxxxx","xxxxxxxxx","2694000,2694025,","mac.brzeski@gmail.com","696 488 332","PL8451829153",null,"X","X"]
[26011363,"AG",null,"xxxxxxxxx","xxxxxxxxx","2694000,2694025,","przemek.siewinski@sportclub.com.pl","604 758 844","PL8522638094",null,null,"X"]
[26010331,"AG",null,"xxxxxxxxx","xxxxxxxxx","2694000,2694017,","piotrek@pzn.pl",601550300,"PL6761028216",null,null,"X"]
[26010296,"AG",null,"xxxxxxxxx","xxxxxxxxx","2694000,2694016,","szkola@ptak-team.pl",601501423,null,null,null,"X"]
[26010156,"AG",null,"xxxxxxxxx","xxxxxxxxx","2694000,2694025,","andrzej.chowaniec@interia.eu",664082207,null,null,"X","X"]
[26010426,"AG",null,"xxxxxxxxx","xxxxxxxxx","2694000,2694025,","m.fedorowska@op.pl",null,null,null,null,"X"]
[26011886,"AG",null,"xxxxxxxxx","xxxxxxxxx","2694000,2694025,","katarzynapyka1996@gmail.com",506171121,"PL6340079713",null,null,"X"]
[26010363,"AG",null,"xxxxxxxxx","xxxxxxxxx","2694000,2694050,","p.bek@pl.head.com",null,null,null,null,"X"]
[26010527,"AG",null,"xxxxxxxxx","xxxxxxxxx","2694000,2694017,","dominik@zillertalinfo.eu",null,"ATU62304517",null,null,"X"]
[26010651,"AG",null,"xxxxxxxxx","xxxxxxxxx","2694000,2694025,","sebastianbulat@wp.pl","605 406 041",null,null,null,"X"]
[26010483,"AG",null,"xxxxxxxxx","xxxxxxxxx","2694000,2694025,","darekc45@wp.pl","792-232-142",null,null,null,"X"]
[26011160,"AG",null,"xxxxxxxxx","xxxxxxxxx","2694000,2694050,","srutka@gmail.com","510 140 100",null,null,null,"X"]
[26010619,"AG",null,"xxxxxxxxx","xxxxxxxxx","2694000,2694025,","sebastian.weber@unilever.com",601560360,null,null,"X","X"]
[26010923,"AG",null,"xxxxxxxxx","xxxxxxxxx","2694000,2694025,","michalsekula88@gmail.com","501 073 827",null,null,null,"X"]
[26011066,"AG",null,"xxxxxxxxx","xxxxxxxxx","2694000,2694016,","faktura@rowerystylowe.pl","+48 603-226-445","PL9251927153",null,"X","X"]
[26011089,"AG",null,"xxxxxxxxx","xxxxxxxxx","2694000,2694025,","biuro@silesiaclub.com","+48 691 493 100","PL6262942232",null,null,"X"]
[26011430,"AG",null,"xxxxxxxxx","xxxxxxxxx","2694000,2694017,","rezerwacja@pensjonat-silverton.pl",609350599,"PL7361426675",null,"X","X"]
[26012060,"AG",null,"xxxxxxxxx","xxxxxxxxx","2694000,2694025,","at@sinetklub.pl","511 314 119","PL6912559125",null,null,"X"]
[26011755,"AG",null,"xxxxxxxxx","xxxxxxxxx","2694000,2694025,","marta.dobkowska@sinnet.pl","601 595 800","PL5210420030",null,null,"X"]
[26010896,"AG",null,"xxxxxxxxx","xxxxxxxxx","2694000,2694025,","weronika@sinussportclub.pl","603 123 371","PL9511023314",null,null,"X"]
[26010723,"AG",null,"xxxxxxxxx","xxxxxxxxx","2694000,2694025,","sportszopa@wp.pl","668 816 551",null,null,null,"X"]
[26011431,"AG",null,"xxxxxxxxx","xxxxxxxxx","2694000,2694025,","piotr.gornicki@demoteam.eu","48 607 462 038",null,null,null,"X"]
[26010159,"AG",null,"xxxxxxxxx","xxxxxxxxx","2694000,2694016,","smialkowski.m@interia.pl",608628047,"PL7352157112",null,"X","X"]
[26011586,"AG",null,"xxxxxxxxx","xxxxxxxxx","2694000,2694017,","ksiegowosc@skiracecenter.pl",696046936,"PL9372452499",null,"X","X"]
[26010131,"AG",null,"xxxxxxxxx","xxxxxxxxx","2694000,2694017,","skirace@skirace.pl",608502200,null,null,"X","X"]
[26010636,"AG",null,"xxxxxxxxx","xxxxxxxxx","2694000,2694017,","skispa@skispa.pl","507 869 227",null,null,null,"X"]
[26011555,"AG",null,"xxxxxxxxx","xxxxxxxxx","2694000,2694017,","marcin.kapel@o2.pl","696 807 355","PL1181486827",null,"X","X"]
[26010582,"AG",null,"xxxxxxxxx","xxxxxxxxx","2694000,2694017,","j.sojka@skisun.pl",null,"PL6772283739",null,null,"X"]
[26012105,"AG",null,"xxxxxxxxx","xxxxxxxxx","2694000,2694016,","kontakt@ski-raft.pl",606987824,"PL8871810663",null,"X","X"]
[26011832,"AG",null,"xxxxxxxxx","xxxxxxxxx","2694000,2694016,","gocor17@gmail.com","508 350 913","PL6221498869",null,null,"X"]
[26011989,"AG",null,"xxxxxxxxx","xxxxxxxxx","2694000,2694016,","futek2@wp.pl","600 239 651","PL6112144380",null,null,"X"]
[26011988,"AG",null,"xxxxxxxxx","xxxxxxxxx","2694000,2694016,","krisspakul@gmail.com",698653421,"PL8862688843",null,null,"X"]
[26011338,"AG",null,"xxxxxxxxx","xxxxxxxxx","2694000,2694016,","skipointszklarska@gmail.com","668 409 242","PL6422957060",null,null,"X"]
[26011422,"AG",null,"xxxxxxxxx","xxxxxxxxx","2694000,2694016,","ewa@sklepmarko.pl",731739605,null,null,null,"X"]
[26011776,"AG",null,"xxxxxxxxx","xxxxxxxxx","2694000,2694025,","sklepmaraton@adres.pl","+48 691404401","PL8652562478",null,null,"X"]
[26010211,"AG",null,"xxxxxxxxx","xxxxxxxxx","2694000,2694016,","mm.cerberus@gmail.com",693347468,null,null,null,"X"]
[26010458,"AG",null,"xxxxxxxxx","xxxxxxxxx","2694000,2694016,","aniakempys@gmail.com","69 7593483",null,null,null,"X"]
[26010244,"AG",null,"xxxxxxxxx","xxxxxxxxx","2694000,2694017,","info@snowandsurf.pl",501708088,"PL5212206507",null,"X","X"]
[26010755,"AG",null,"xxxxxxxxx","xxxxxxxxx","2694000,2694017,","andrzej.lesiewski@snowpr.pl",512348232,"PL8942392145",null,null,"X"]
[26010128,"AG",null,"xxxxxxxxx","xxxxxxxxx","2694000,2694016,","jarek@snowriders.pl",509636910,null,null,null,"X"]
[26011091,"AG",null,"xxxxxxxxx","xxxxxxxxx","2694000,2694025,","soniagrzywocz@hotmail.com","784 912 318",null,null,null,"X"]
[26011271,"AG",null,"xxxxxxxxx","xxxxxxxxx","2694000,2694025,","tomektennis@poczta.fm","796 757 818",null,null,null,"X"]
[26011052,"AG",null,"xxxxxxxxx","xxxxxxxxx","2694000,2694016,","ksowa.krakow@gmail.com",48664455992,"PL6772148881",null,null,"X"]
[26010032,"AG",null,"xxxxxxxxx","xxxxxxxxx","2694000,2694016,","speedfocus@interia.eu",662231246,"PL5732447861",null,"X","X"]
[26010670,"AG",null,"xxxxxxxxx","xxxxxxxxx","2694000,2694017,","speedsport@interia.eu","608 824 311","PL7352027869",null,"X","X"]
[26010069,"AG",null,"xxxxxxxxx","xxxxxxxxx","2694000,2694016,","mirek.ragan@spokobrand.com",519130085,null,null,null,"X"]
[26011377,"AG",null,"xxxxxxxxx","xxxxxxxxx","2694000,2694015,","tomek@tatrainfo.pl",182012456,"PL7361010377",null,null,"X"]
[26010421,"AG",null,"xxxxxxxxx","xxxxxxxxx","2694000,2694017,","sklep@skifanatic.pl",664470003,"PL9512212684",null,"X","X"]
[26011680,"AG",null,"xxxxxxxxx","xxxxxxxxx","2694000,2694025,","Kinga.szynklarz@gmail.com",664017140,null,null,"X","X"]
[26011966,"AG",null,"xxxxxxxxx","xxxxxxxxx","2694000,2694016,","lk@sportp.pl",601669789,"PL6351823150",null,null,"X"]
[26011210,"AG",null,"xxxxxxxxx","xxxxxxxxx","2694000,2694016,","sklep@sportrent.pl",602515954,"PL5481778482",null,null,"X"]
[26010536,"AG",null,"xxxxxxxxx","xxxxxxxxx","2694000,2694016,","adam_stepien@outlook.com",null,null,null,null,"X"]
[26011044,"AG",null,"xxxxxxxxx","xxxxxxxxx","2694000,2694025,","sportstylanna@interia.pl","605 691 291","PL9111633670",null,null,"X"]
[26011336,"AG",null,"xxxxxxxxx","xxxxxxxxx","2694000,2694025,","jaroslaw.woznica@tennisterritory.com","606 611 285","PL7631275514",null,null,"X"]
[26011984,"AG",null,"xxxxxxxxx","xxxxxxxxx","2694000,2694016,","bartlomiej.glomba@sportvita.pl","+48 32 230 92 90","PL6312620282",null,null,"X"]
[26010771,"AG",null,"xxxxxxxxx","xxxxxxxxx","2694000,2694016,","zuru58@tlen.pl","602 264 865",null,null,null,"X"]
[26010467,"AG",null,"xxxxxxxxx","xxxxxxxxx","2694000,2694017,","kuba@s-mania.pl","607 886 046",null,null,null,"X"]
[26010628,"AG",null,"xxxxxxxxx","xxxxxxxxx","2694000,2694025,","skiing@op.pl","693 977 877","PL8271872727",null,null,"X"]
[26010278,"AG",null,"xxxxxxxxx","xxxxxxxxx","2694000,2694016,","marek.bross@interia.pl",602762614,null,null,"X","X"]
[26011687,"AG",null,"xxxxxxxxx","xxxxxxxxx","2694000,2694016,","info@sportbaza.pl",601797668,"PL6342904989",null,"X","X"]
[26011357,"AG",null,"xxxxxxxxx","xxxxxxxxx","2694000,2694017,","racing@sporteum.pl","+48 729 041 479",null,null,null,"X"]
[26010040,"AG",null,"xxxxxxxxx","xxxxxxxxx","2694000,2694017,","biuroskitenis@wp.pl",605440560,null,null,null,"X"]
[26010707,"AG",null,"xxxxxxxxx","xxxxxxxxx","2694000,2694016,","darek@ryskalski.pl",601082768,null,null,null,"X"]
[26011667,"AG",null,"xxxxxxxxx","xxxxxxxxx","2694000,2694025,","piotr.kolasa@sportszok.pl","600 359 133",null,null,"X","X"]
[26010682,"AG",null,"xxxxxxxxx","xxxxxxxxx","2694000,2694025,","wojciech.wrzol@bdm.pl","501 307 154","PL9372647932",null,"X","X"]
[26011009,"AG",null,"xxxxxxxxx","xxxxxxxxx","2694000,2694025,","info@sportsystem.pl","48 89 524 05 64","PL7393851849",null,"X","X"]
[26011512,"AG",null,"xxxxxxxxx","xxxxxxxxx","2694000,2694016,","ms@narowery.pl","505-748-421","PL6991852769",null,null,"X"]
[26010927,"AG",null,"xxxxxxxxx","xxxxxxxxx","2694000,2694025,","kaamil.dudek@gmail.com","602-691-200",null,null,null,"X"]
[26010740,"AG",null,"xxxxxxxxx","xxxxxxxxx","2694000,2694025,","czyzowski.marcin@gmail.com","530 274 199","PL6832082023",null,"X","X"]
[26010783,"AG",null,"xxxxxxxxx","xxxxxxxxx","2694000,2694025,","squashcity@onet.pl","(22) 499 64 66","PL1181885527",null,null,"X"]
[26011543,"AG",null,"xxxxxxxxx","xxxxxxxxx","2694000,2694025,","adrian.janik@op.pl","502-911-250",null,null,"X","X"]
[26011561,"AG",null,"xxxxxxxxx","xxxxxxxxx","2694000,2694017,","kontakt@skisuche.com","604 595 959",null,null,null,"X"]
[26010929,"AG",null,"xxxxxxxxx","xxxxxxxxx","2694000,2694025,","m4107@wp.pl","665 684 744",null,null,null,"X"]
[26010562,"AG",null,"xxxxxxxxx","xxxxxxxxx","2694000,2694050,","tenisista70@wp.pl","501 198 880",null,null,null,"X"]
[26010500,"AG",null,"xxxxxxxxx","xxxxxxxxx","2694000,2694050,","Jacek.domanski@dsk.com.pl","667 977 527",null,null,null,"X"]
[26010766,"AG",null,"xxxxxxxxx","xxxxxxxxx","2694000,2694016,","romuald@start.org.pl","602 614 892",null,null,null,"X"]
[26011311,"AG",null,"xxxxxxxxx","xxxxxxxxx","2694000,2694025,","mfokt@wp.pl","608 426 333",null,null,null,"X"]
[26010548,"AG",null,"xxxxxxxxx","xxxxxxxxx","2694000,2694016,","ksm.labski@gmail.com",null,null,null,null,"X"]
[26011346,"AG",null,"xxxxxxxxx","xxxxxxxxx","2694000,2694025,","jakub.slowinski@pfpadla.pl","607 576 322","PL7972064089",null,null,"X"]
[26010452,"AG",null,"xxxxxxxxx","xxxxxxxxx","2694000,2694016,","patrycjapolak@wp.pl",508475092,null,null,null,"X"]
[26010112,"AG",null,"xxxxxxxxx","xxxxxxxxx","2694000,2694016,","ski-team@wp.pl",601082768,null,null,null,"X"]
[26010431,"AG",null,"xxxxxxxxx","xxxxxxxxx","2694000,2694016,","robert@zubekski.pl",509276767,null,null,null,"X"]
[26010607,"AG",null,"xxxxxxxxx","xxxxxxxxx","2694000,2694017,","bugaj.olga@gmail.com","691 560 929",null,null,null,"X"]
[26010727,"AG",null,"xxxxxxxxx","xxxxxxxxx","2694000,2694025,","tomek.2hills@gmail.com","600 402 903",null,null,null,"X"]
[26010637,"AG",null,"xxxxxxxxx","xxxxxxxxx","2694000,2694017,","sylwestrzak@o2.pl",506140168,"PL7010469498",null,"X","X"]
[26011822,"AG",null,"xxxxxxxxx","xxxxxxxxx","2694000,2694016,","biuro@strefazimy.pl",693429329,null,null,null,"X"]
[26010798,"AG",null,"xxxxxxxxx","xxxxxxxxx","2694000,2694025,","rafal.mikos@icloud.com","501 420 740",null,null,null,"X"]
[26011746,"AG",null,"xxxxxxxxx","xxxxxxxxx","2694000,2694016,","sroczek@gmail.com","601 825 395",null,null,null,"X"]
[26010485,"AG",null,"xxxxxxxxx","xxxxxxxxx","2694000,2694050,","robert@chsukces.pl",509398836,null,null,null,"X"]
[26011095,"AG",null,"xxxxxxxxx","xxxxxxxxx","2694000,2694025,","monika.solecka@sunbarrel.pl","+48 534 957 342","PL8971783049",null,null,"X"]
[26011986,"AG",null,"xxxxxxxxx","xxxxxxxxx","2694000,2694016,","biuro@supersportowy.pl","796 355 171","PL7773195624",null,"X","X"]
[26011163,"AG",null,"xxxxxxxxx","xxxxxxxxx","2694000,2694016,","info@supersporty.pl","603 347 555",null,null,"X","X"]
[26012064,"AG",null,"xxxxxxxxx","xxxxxxxxx","2694000,2694017,","agapotocka@ndsport.pl",48504090807,null,null,null,"X"]
[26010378,"AG",null,"xxxxxxxxx","xxxxxxxxx","2694000,2694017,","faktury@surfoteka.pl","600 884 411","PL5842289570",null,"X","X"]
[26011262,"AG",null,"xxxxxxxxx","xxxxxxxxx","2694000,2694025,","mjordan@poznanopen.pl",null,"PL7811801714",null,null,"X"]
[26010650,"AG",null,"xxxxxxxxx","xxxxxxxxx","2694000,2694025,","sylwiacwyl@gmail.com","605-698-129",null,null,null,"X"]
[26010321,"AG",null,"xxxxxxxxx","xxxxxxxxx","2694000,2694016,","dariusz.staniszewski@fjordnansen.pl","058 625-93-09","PL5860221602",null,null,"X"]
[26011383,"AG",null,"xxxxxxxxx","xxxxxxxxx","2694000,2694016,","d.caputa@op.pl","665 337 264",null,null,null,"X"]
[26011345,"AG",null,"xxxxxxxxx","xxxxxxxxx","2694000,2694016,","adzwoniarska@o2.pl","+48 504 207 842",null,null,null,"X"]
[26010992,"AG",null,"xxxxxxxxx","xxxxxxxxx","2694000,2694016,","sbl@paralotnie.szczyrk.pl","698 805 229","PL5472059658",null,null,"X"]
[26011681,"AG",null,"xxxxxxxxx","xxxxxxxxx","2694000,2694016,","sbl@paralotnie.szczyrk.pl","+48 698 805 229","PL5472059658",null,null,"X"]
[26011397,"AG",null,"xxxxxxxxx","xxxxxxxxx","2694000,2694016,","beta-ski@wp.pl","609 608 070",null,null,null,"X"]
[26011398,"AG",null,"xxxxxxxxx","xxxxxxxxx","2694000,2694017,","karol95@op.pl",660445621,null,null,null,"X"]
[26010698,"AG",null,"xxxxxxxxx","xxxxxxxxx","2694000,2694016,","Biuro@hski.pl","502 025 628",null,null,"X","X"]
[26011573,"AG",null,"xxxxxxxxx","xxxxxxxxx","2694016,2694016,","biuro@bactive.com.pl","+48 515093050",null,null,null,"X"]
[26010060,"AG",null,"xxxxxxxxx","xxxxxxxxx","2694000,2694016,","beta-ski@wp.pl",609608070,null,null,null,"X"]
[26011202,"AG",null,"xxxxxxxxx","xxxxxxxxx","2694000,2694016,","biuro@startbeskid.pl","48 602 692 845",null,null,null,"X"]
[26010000,"AG",null,"xxxxxxxxx","xxxxxxxxx","2694000,2694017,","tz@strefasport.pl",604486971,null,null,null,"X"]
[26010741,"AG",null,"xxxxxxxxx","xxxxxxxxx","2694000,2694016,","jumbo@jumbosport.pl",502484090,null,null,null,"X"]
[26010555,"AG",null,"xxxxxxxxx","xxxxxxxxx","2694000,2694016,","ski@karpacz.net.pl",537006767,"PL6111167893",null,null,"X"]
[26010970,"AG",null,"xxxxxxxxx","xxxxxxxxx","2694000,2694025,","dareks32@wp.pl","603 111 442",null,null,null,"X"]
[26010130,"AG",null,"xxxxxxxxx","xxxxxxxxx","2694000,2694017,","biuro.fansport@gmail.com",604935409,"PL8151234042",null,null,"X"]
[26011276,"AG",null,"xxxxxxxxx","xxxxxxxxx","2694000,2694025,","tomektennis@poczta.fm","796 757 818","PL7393333132",null,null,"X"]
[26010837,"AG",null,"xxxxxxxxx","xxxxxxxxx","2694000,2694025,","tomektennis@poczta.fm",796757818,null,null,null,"X"]
[26011856,"AG",null,"xxxxxxxxx","xxxxxxxxx","2694000,2694025,","adamdrys@live.com",606782999,"PL7952401141",null,null,"X"]
[26011628,"AG",null,"xxxxxxxxx","xxxxxxxxx","2694000,2694025,","trener.adriansobczak@gmail.com","607 445 346",null,null,"X","X"]
[26011609,"AG",null,"xxxxxxxxx","xxxxxxxxx","2694000,2694025,","Robert.usarek@op.pl","509 094 653",null,null,null,"X"]
[26010035,"AG",null,"xxxxxxxxx","xxxxxxxxx","2694000,2694025,","szkola_gem@o2.pl",605465081,null,null,null,"X"]
[26011823,"AG",null,"xxxxxxxxx","xxxxxxxxx","2694000,2694025,","maciek-2002@wp.pl","604 200 221","PL9471848349",null,null,"X"]
[26011408,"AG",null,"xxxxxxxxx","xxxxxxxxx","2694000,2694025,","michalsekula88@gmail.com",501073827,null,null,null,"X"]
[26012095,"AG",null,"xxxxxxxxx","xxxxxxxxx","2694000,2694025,","karolina.rejniak.oszczyk@gmail.com","535 977 850",null,null,null,"X"]
[26011775,"AG",null,"xxxxxxxxx","xxxxxxxxx","2694000,2694025,","arysz08@gmail.com","796 728 966","PL6852327858",null,"X","X"]
[26010002,"AG",null,"xxxxxxxxx","xxxxxxxxx","2694000,2694025,","weresz@poczta.onet.pl",504271173,"PL7341576868",null,null,"X"]
[26010731,"AG",null,"xxxxxxxxx","xxxxxxxxx","2694000,2694025,","slawek.kurek@op.pl",602275331,null,null,null,"X"]
[26010874,"AG",null,"xxxxxxxxx","xxxxxxxxx","2694000,2694025,","szkola@proteniskrakow.pl",784037097,null,null,"X","X"]
[26010064,"AG",null,"xxxxxxxxx","xxxxxxxxx","2694000,2694016,","ewa@szkolazdrowia.pl",602178208,null,null,null,"X"]
[26011501,"AG",null,"xxxxxxxxx","xxxxxxxxx","2694000,2694016,","ewa@szkolazdrowia.pl","48 668 160 160",null,null,null,"X"]
[26010101,"AG",null,"xxxxxxxxx","xxxxxxxxx","2694000,2694016,","elita@elita.krakow.pl",602623484,null,null,"X","X"]
[26010855,"AG",null,"xxxxxxxxx","xxxxxxxxx","2694000,2694025,","trenejros@icloud.com","502 509 470",null,null,null,"X"]
[26010869,"AG",null,"xxxxxxxxx","xxxxxxxxx","2694000,2694016,","biuro@frajda.zakopane.pl","604 448 784",null,null,null,"X"]
[26010834,"AG",null,"xxxxxxxxx","xxxxxxxxx","2694000,2694016,","gerard.arges@gmail.com",604226631,null,null,null,"X"]
[26011651,"AG",null,"xxxxxxxxx","xxxxxxxxx","2694000,2694015,","szymon@gostynski.net",515181877,null,null,null,"X"]
[26011661,"AG",null,"xxxxxxxxx","xxxxxxxxx","2694000,2694050,","mac_kas@o2.pl","797 675 809",null,null,null,"X"]
[26011371,"AG",null,"xxxxxxxxx","xxxxxxxxx","2694000,2694050,","juha_mieto2@interia.pl","607 950 160",null,null,null,"X"]
[26011690,"AG",null,"xxxxxxxxx","xxxxxxxxx","2694000,2694025,","skrakowiak96@gmail.com",517451522,null,null,null,"X"]
[26010971,"AG",null,"xxxxxxxxx","xxxxxxxxx","2694000,2694050,","flololus.1@gmail.com","536 950 623",null,null,null,"X"]
[26011014,"AG",null,"xxxxxxxxx","xxxxxxxxx","2694000,2694016,","slaw-ski@wp.pl","606 833 454",null,null,null,"X"]
[26010786,"AG",null,"xxxxxxxxx","xxxxxxxxx","2694000,2694025,","s.dylag@grupads.com.pl",null,null,null,null,"X"]
[26011547,"AG",null,"xxxxxxxxx","xxxxxxxxx","2694000,2694050,","slawomir.ignasiak@wp.pl","696-712-673",null,null,null,"X"]
[26011098,"AG",null,"xxxxxxxxx","xxxxxxxxx","2694000,2694025,","ortho-projekt@post.pl","697 096 600",null,null,null,"X"]
[26010773,"AG",null,"xxxxxxxxx","xxxxxxxxx","2694000,2694025,","slawekpolec76@gmail.com","668 242 276",null,null,null,"X"]
[26010890,"AG",null,"xxxxxxxxx","xxxxxxxxx","2694000,2694025,","mm.cerberus@gmail.com","693 347 468",null,null,null,"X"]
[26010213,"AG",null,"xxxxxxxxx","xxxxxxxxx","2694000,2694025,","biuro.stt@o2.pl",604590874,null,null,null,"X"]
[26011212,"AG",null,"xxxxxxxxx","xxxxxxxxx","2694000,2694017,","talarinio@onet.pl",null,null,null,null,"X"]
[26011649,"AG",null,"xxxxxxxxx","xxxxxxxxx","2694000,2694016,","biuro@sportnet-ski.pl","+48 501 59 49 29","PL9442253180",null,null,"X"]
[26010781,"AG",null,"xxxxxxxxx","xxxxxxxxx","2694000,2694017,","tbmsport@gmail.com",504154434,"PL7361420721",null,null,"X"]
[26011081,"AG",null,"xxxxxxxxx","xxxxxxxxx","2694000,2694025,","tennisroompl@gmail.com","787-314-387",null,null,null,"X"]
[26011873,"AG",null,"xxxxxxxxx","xxxxxxxxx","2694000,2694025,","filiplamczyk@gmail.com",692645754,"PL5552130803",null,null,"X"]
[26010961,"AG",null,"xxxxxxxxx","xxxxxxxxx","2694000,2694025,","info@sportowyteam.pl","601 593 267","PL7470005961",null,null,"X"]
[26011534,"AG",null,"xxxxxxxxx","xxxxxxxxx","2694000,2694016,","jacek.rojewski@gmail.com",509842213,"PL7361476928",null,"X","X"]
[26011071,"AG",null,"xxxxxxxxx","xxxxxxxxx","2694000,2694016,","g.zakrzewski@o2.pl","795 515 765","PL9452127956",null,null,"X"]
[26011818,"AG",null,"xxxxxxxxx","xxxxxxxxx","2694000,2694025,","tenisowo.naklo@gmail.com","531 509 929",null,null,null,"X"]
[26011370,"AG",null,"xxxxxxxxx","xxxxxxxxx","2694000,2694025,","j.kosek@tenniscountryclub.pl",693124641,"PL6793112411",null,"X","X"]
[26011622,"AG",null,"xxxxxxxxx","xxxxxxxxx","2694000,2694025,","andrzej.rosol@tennis-open.pl",609271277,"PL2220918072",null,"X","X"]
[26011664,"AG",null,"xxxxxxxxx","xxxxxxxxx","2694000,2694025,","brzozka.bartlomiej@gmail.com",507972070,null,null,"X","X"]
[26010886,"AG",null,"xxxxxxxxx","xxxxxxxxx","2694000,2694025,","Patka@balx.pl",515777337,"PL7291626238",null,null,"X"]
[26010919,"AG",null,"xxxxxxxxx","xxxxxxxxx","2694000,2694025,","remek@konaworld.pl","604 179 900",null,null,"X","X"]
[26011221,"AG",null,"xxxxxxxxx","xxxxxxxxx","2694000,2694017,","tomaszbabiak@yahoo.pl",604095400,"PL9452178534",null,"X","X"]
[26011418,"AG",null,"xxxxxxxxx","xxxxxxxxx","2694000,2694025,","km.mular@gmail.com","609 083 500",null,null,null,"X"]
[26011218,"AG",null,"xxxxxxxxx","xxxxxxxxx","2694000,2694017,","truski@vip.onet.pl","501 08 39 48",null,null,null,"X"]
[26011032,"AG",null,"xxxxxxxxx","xxxxxxxxx","2694000,2694017,","a.wrobel@trybik.pl","793-396-717",null,null,"X","X"]
[26011082,"AG",null,"xxxxxxxxx","xxxxxxxxx","2694000,2694025,","ts@podhalanski.pl","600 383 350",null,null,null,"X"]
[26011051,"AG",null,"xxxxxxxxx","xxxxxxxxx","2694000,2694025,","mossakowski.pawel@gmail.com","793 919 326",null,null,null,"X"]
[26011944,"AG",null,"xxxxxxxxx","xxxxxxxxx","2694000,2694017,","kasper.leonowicz@gmail.com",609268449,"PL6772268214",null,null,"X"]
[26011395,"AG",null,"xxxxxxxxx","xxxxxxxxx","2694000,2694050,","agata_czagowiec@tvn.pl","+48 22 453 62 16","PL9510057883",null,null,"X"]
[26011433,"AG",null,"xxxxxxxxx","xxxxxxxxx","2694000,2694025,","biuro@tytan.shop","727 40 50 27","PL8991300054",null,"X","X"]
[26010567,"AG",null,"xxxxxxxxx","xxxxxxxxx","2694000,2694016,","tadektadek@wp.pl","605 736 266",null,null,"X","X"]
[26010492,"AG",null,"xxxxxxxxx","xxxxxxxxx","2694000,2694025,","tenistkt@gmail.com","601-47-41-48",null,null,null,"X"]
[26010700,"AG",null,"xxxxxxxxx","xxxxxxxxx","2694000,2694017,","aga@tatraskiacademy.pl",602796500,null,null,null,"X"]
[26010787,"AG",null,"xxxxxxxxx","xxxxxxxxx","2694000,2694015,","mista@tmr.sk","910 818 223","SK2020428036",null,null,"X"]
[26010932,"AG",null,"xxxxxxxxx","xxxxxxxxx","2694000,2694017,","biuro@teamspirit.pl","48 22 815 42 03",null,null,null,"X"]
[26010624,"AG",null,"xxxxxxxxx","xxxxxxxxx","2694000,2694025,","tenisarena@onet.pl","507 149 591","PL6312645767",null,null,"X"]
[26010785,"AG",null,"xxxxxxxxx","xxxxxxxxx","2694000,2694025,","tenis_club_piter_play@vp.pl","602 866 640",null,null,null,"X"]
[26010790,"AG",null,"xxxxxxxxx","xxxxxxxxx","2694000,2694025,","sokolik.tomek@wp.pl",607044633,null,null,null,"X"]
[26010691,"AG",null,"xxxxxxxxx","xxxxxxxxx","2694000,2694025,","sylwia@lechiatennisclub.pl","604 205 505","PL8982211109",null,"X","X"]
[26010473,"AG",null,"xxxxxxxxx","xxxxxxxxx","2694000,2694025,","m.sak-paszkiewicz@olimpijskiclub.pl",null,"PL8982186742",null,null,"X"]
[26010882,"AG",null,"xxxxxxxxx","xxxxxxxxx","2694000,2694050,","pieniak@pzt.pl","600 95 20 21","PL1132892088",null,null,"X"]
[26010472,"AG",null,"xxxxxxxxx","xxxxxxxxx","2694000,2694025,","jacekmerwart@wp.pl","601 586 529",null,null,null,"X"]
[26010818,"AG",null,"xxxxxxxxx","xxxxxxxxx","2694000,2694025,","kontakt@teniscentrum.pl","503 303 621",null,null,null,"X"]
[26010184,"AG",null,"xxxxxxxxx","xxxxxxxxx","2694000,2694025,","krzysztorn@wp.pl",503303621,null,null,null,"X"]
[26011571,"AG",null,"xxxxxxxxx","xxxxxxxxx","2694000,2694025,","teniskrakow@me.com","505 530 053","PL6852139720",null,null,"X"]
[26010675,"AG",null,"xxxxxxxxx","xxxxxxxxx","2694000,2694025,","tukszdun@gmail.com","693 851 275",null,null,"X","X"]
[26011692,"AG",null,"xxxxxxxxx","xxxxxxxxx","2694000,2694050,","WojtekLutek@interia.pl","697 101 067",null,null,null,"X"]
[26011153,"AG",null,"xxxxxxxxx","xxxxxxxxx","2694000,2694025,","instincttennis@gmail.com",509539548,null,null,"X","X"]
[26010134,"AG",null,"xxxxxxxxx","xxxxxxxxx","2694000,2694025,","tomas599@hotmail.com",607929897,"PL7262637222",null,"X","X"]
[26010102,"AG",null,"xxxxxxxxx","xxxxxxxxx","2694000,2694025,","kontakt@squashtime.pl",602111074,"PL6871693908",null,"X","X"]
[26010591,"AG",null,"xxxxxxxxx","xxxxxxxxx","2694000,2694016,","tgmotor01@gmail.com",504220433,null,null,null,"X"]
[26010726,"AG",null,"xxxxxxxxx","xxxxxxxxx","2694000,2694025,","maciekhuczko@gmail.com",null,null,null,null,"X"]
[26010526,"AG",null,"xxxxxxxxx","xxxxxxxxx","2694000,2694025,","bok@skleptenisisty.pl","608 458 528","PL6472533669",null,"X","X"]
[26012108,"AG",null,"xxxxxxxxx","xxxxxxxxx","2694000,2694017,","mlynarczykmaciej22@gmail.com","518 488 959",null,null,null,"X"]
[26010618,"AG",null,"xxxxxxxxx","xxxxxxxxx","2694000,2694016,","jacek.wycislik@tirolski.pl","501 560 381","PL6412531052",null,null,"X"]
[26010198,"AG",null,"xxxxxxxxx","xxxxxxxxx","2694000,2694016,","jacek.wycislik@tirolski.pl",501560381,null,null,"X","X"]
[26011302,"AG",null,"xxxxxxxxx","xxxxxxxxx","2694000,2694016,","przemyslav.novak@gmail.com","48 695 996 024",null,null,null,"X"]
[26011871,"AG",null,"xxxxxxxxx","xxxxxxxxx","2694000,2694025,","tomasz991.9@gmail.com","513 171 246",null,null,null,"X"]
[26011754,"AG",null,"xxxxxxxxx","xxxxxxxxx","2694000,2694025,","tgietkowski1@wp.pl","508 011 955",null,null,null,"X"]
[26011087,"AG",null,"xxxxxxxxx","xxxxxxxxx","2694000,2694016,","tgorszko@yahoo.com","794 921 182",null,null,null,"X"]
[26010722,"AG",null,"xxxxxxxxx","xxxxxxxxx","2694000,2694025,","tomektennis@poczta.fm","796 757 818",null,null,null,"X"]
[26011001,"AG",null,"xxxxxxxxx","xxxxxxxxx","2694000,2694050,","tpkagi@gmail.com","601 833 601",null,null,null,"X"]
[26011116,"AG",null,"xxxxxxxxx","xxxxxxxxx","2694000,2694025,","tmuszer@gmail.com",606135475,null,null,"X","X"]
[26011249,"AG",null,"xxxxxxxxx","xxxxxxxxx","2694000,2694050,","tp-ch@protonmail.ch","537 306 306",null,null,null,"X"]
[26011241,"AG",null,"xxxxxxxxx","xxxxxxxxx","2694000,2694050,","tp-ch@protonmail.ch","537 306 306",null,null,null,"X"]
[26011934,"AG",null,"xxxxxxxxx","xxxxxxxxx","2694000,2694016,","tomek_wasniowski@tlen.pl",798159538,null,null,"X","X"]
[26010842,"AG",null,"xxxxxxxxx","xxxxxxxxx","2694000,2694025,","tomaszrawicz@gmail.com","+48 501 102 554","PL6991018486",null,null,"X"]
[26010975,"AG",null,"xxxxxxxxx","xxxxxxxxx","2694000,2694016,","czerwin53@wp.pl","602 154 969","PL8341003452",null,null,"X"]
[26010498,"AG",null,"xxxxxxxxx","xxxxxxxxx","2694000,2694017,","info@tnfic.pl","(0 22) 825 91 56",null,null,null,"X"]
[26010049,"AG",null,"xxxxxxxxx","xxxxxxxxx","2694000,2694016,","janusz.kucharz@plusnet.pl",601432009,null,null,null,"X"]
[26010586,"AG",null,"xxxxxxxxx","xxxxxxxxx","2694000,2694050,","monika.malek@toyota.pl",null,"PL5210123177",null,null,"X"]
[26011715,"AG",null,"xxxxxxxxx","xxxxxxxxx","2694000,2694025,","wikmaster@gmail.com",null,"PL6452403389",null,null,"X"]
[26010191,"AG",null,"xxxxxxxxx","xxxxxxxxx","2694000,2694015,","p.drzyzgiewicz@pl.head.com",618742295,"PL7811011998",null,"X","X"]
[26010365,"AG",null,"xxxxxxxxx","xxxxxxxxx","2694000,2694017,","ania@ehschool.pl","+48 509 338 388","PL7251862843",null,null,"X"]
[26011645,"AG",null,"xxxxxxxxx","xxxxxxxxx","2694000,2694025,","rafal_rutkowski@onet.pl","516 527 969",null,null,null,"X"]
[26010986,"AG",null,"xxxxxxxxx","xxxxxxxxx","2694000,2694025,","sklep@frontside.pl","795 127 461","PL7251483353",null,null,"X"]
[26010369,"AG",null,"xxxxxxxxx","xxxxxxxxx","2694000,2694017,","sklep@trojansport.pl",null,"PL7343100667",null,"X","X"]
[26010949,"AG",null,"xxxxxxxxx","xxxxxxxxx","2694000,2694017,","sklep@trojansport.pl",662125229,"PL7343540403",null,"X","X"]
[26010239,"AG",null,"xxxxxxxxx","xxxxxxxxx","2694000,2694017,","bartolomej@poczta.onet.pl",608059725,null,null,null,"X"]
[26010468,"AG",null,"xxxxxxxxx","xxxxxxxxx","2694000,2694017,","ulawasowicz@gmail.com","664 978 068",null,null,null,"X"]
[26011411,"AG",null,"xxxxxxxxx","xxxxxxxxx","2694000,2694025,","szkola_gem@o2.pl","605 465 081",null,null,null,"X"]
[26011236,"AG",null,"xxxxxxxxx","xxxxxxxxx","2694000,2694016,","kna-dzikowiec@wp.pl",570408343,null,null,"X","X"]
[26010227,"AG",null,"xxxxxxxxx","xxxxxxxxx","2694000,2694016,","d.caputa@op.pl",665337264,null,null,null,"X"]
[26011042,"AG",null,"xxxxxxxxx","xxxxxxxxx","2694000,2694016,","ulksczarnagora@poczta.fm","48 604277719",null,null,null,"X"]
[26011526,"AG",null,"xxxxxxxxx","xxxxxxxxx","2694000,2694025,","faktury@unit.eu.com","535 666 939","PL5213876090",null,"X","X"]
[26012021,"AG",null,"xxxxxxxxx","xxxxxxxxx","2694000,2694025,","dawidkapral@gmail.com",530095946,null,null,null,"X"]
[26011804,"AG",null,"xxxxxxxxx","xxxxxxxxx","2694000,2694016,","jakubiec_bud@yahoo.pl",512166186,"PL9371789707",null,null,"X"]
[26011028,"AG",null,"xxxxxxxxx","xxxxxxxxx","2694000,2694016,","gimnazjum@istebna.com",662022078,null,null,null,"X"]
[26011316,"AG",null,"xxxxxxxxx","xxxxxxxxx","2694000,2694016,","kna-dzikowiec@wp.pl",570408343,null,null,null,"X"]
[26010018,"AG",null,"xxxxxxxxx","xxxxxxxxx","2694000,2694016,","uks@brenna.pl",601912880,null,null,null,"X"]
[26010999,"AG",null,"xxxxxxxxx","xxxxxxxxx","2694000,2694025,","darek.janas@o2.pl","604 347 076",null,null,null,"X"]
[26010006,"AG",null,"xxxxxxxxx","xxxxxxxxx","2694000,2694025,","sokolik.tomek@wp.pl",607044633,null,null,null,"X"]
[26010880,"AG",null,"xxxxxxxxx","xxxxxxxxx","2694000,2694025,","michal.kostecki1@gmail.com","694 399 001",null,null,null,"X"]
[26012013,"AG",null,"xxxxxxxxx","xxxxxxxxx","2694000,2694025,","piotrek264@wp.pl","508 139 320",null,null,null,"X"]
[26011324,"AG",null,"xxxxxxxxx","xxxxxxxxx","2694000,2694050,","teniswinner@gmail.com",608158691,null,null,"X","X"]
[26011933,"AG",null,"xxxxxxxxx","xxxxxxxxx","2694000,2694025,","dka@unilog.eu","536 327 062","PL9581554011",null,null,"X"]
[26010245,"AG",null,"xxxxxxxxx","xxxxxxxxx","2694000,2694025,","sklep@erakiety.com",501099066,"PL5213560659",null,"X","X"]
[26011222,"AG",null,"xxxxxxxxx","xxxxxxxxx","2694000,2694017,","kontakt@unlimitedsports.pl","791 612 605",null,null,null,"X"]
[26011344,"AG",null,"xxxxxxxxx","xxxxxxxxx","2694000,2694017,","kontakt@unlimitedsports.pl","791 612 605",null,null,null,"X"]
[26010080,"AG",null,"xxxxxxxxx","xxxxxxxxx","2694000,2694025,","tomasz.garsztka@onet.pl",604936845,null,null,"X","X"]
[26010118,"AG",null,"xxxxxxxxx","xxxxxxxxx","2694000,2694016,","ewatorunska12@gmail.com",697068571,null,null,null,"X"]
[26011278,"AG",null,"xxxxxxxxx","xxxxxxxxx","2694000,2694016,","cinekko@onet.eu",694311007,null,null,null,"X"]
[26011386,"AG",null,"xxxxxxxxx","xxxxxxxxx","2694000,2694025,","przemekatras@gmail.com","517 - 827 - 720",null,null,"X","X"]
[26010026,"AG",null,"xxxxxxxxx","xxxxxxxxx","2694000,2694025,","bozenasorychta@onet.pl",609823953,null,null,null,"X"]
[26010385,"AG",null,"xxxxxxxxx","xxxxxxxxx","2694000,2694017,","witold.gatarski@interia.pl",126361400,null,null,null,"X"]
[26011127,"AG",null,"xxxxxxxxx","xxxxxxxxx","2694000,2694025,","jacek@domenasportowa.pl",null,null,null,"X","X"]
[26010420,"AG",null,"xxxxxxxxx","xxxxxxxxx","2694000,2694017,","biuro@everest-sport.pl",602405012,"PL5832115779",null,null,"X"]
[26010853,"AG",null,"xxxxxxxxx","xxxxxxxxx","2694000,2694016,","jaskiewicz@vitroform.pl","607 628 992","PL6832048598",null,null,"X"]
[26011738,"AG",null,"xxxxxxxxx","xxxxxxxxx","2694000,2694050,","piotr.voigt@gmail.com","500 046 487",null,null,null,"X"]
[26010037,"AG",null,"xxxxxxxxx","xxxxxxxxx","2694000,2694016,","maciek@forehand.pl",600353590,"PL5732719992",null,"X","X"]
[26010476,"AG",null,"xxxxxxxxx","xxxxxxxxx","2694000,2694025,","jwasowski@gazeta.pl","606-705-604",null,null,null,"X"]
[26010804,"AG",null,"xxxxxxxxx","xxxxxxxxx","2694000,2694017,","sieprawski@onet.eu","12 269 05 99","PL6792642377",null,null,"X"]
[26010247,"AG",null,"xxxxxxxxx","xxxxxxxxx","2694000,2694017,","wkn@wkn.pl",228240956,"PL5212222239",null,null,"X"]
[26010436,"AG",null,"xxxxxxxxx","xxxxxxxxx","2694000,2694016,","k.piasecka90@gmail.com",790738728,null,null,null,"X"]
[26012140,"AG",null,"xxxxxxxxx","xxxxxxxxx","2694000,2694025,","andrzejgronowski@gmail.com",509452929,"PL5993261724",null,"X","X"]
[26011242,"AG",null,"xxxxxxxxx","xxxxxxxxx","2694000,2694017,","maciek@weski.pl","880 853 532","PL6842497435",null,null,"X"]
[26010082,"AG",null,"xxxxxxxxx","xxxxxxxxx","2694000,2694025,","biuro@whitesports.pl",603874201,"PL6770043824",null,null,"X"]
[26012068,"AG",null,"xxxxxxxxx","xxxxxxxxx","2694000,2694025,","wiernektennisclub@gmail.com",784510093,null,null,null,"X"]
[26010602,"AG",null,"xxxxxxxxx","xxxxxxxxx","2694000,2694025,","maticzyzewski@gmail.com","662-242-240",null,null,null,"X"]
[26010689,"AG",null,"xxxxxxxxx","xxxxxxxxx","2694000,2694025,","Pawel.dzikiewicz@yahoo.com",660477685,null,null,null,"X"]
[26010780,"AG",null,"xxxxxxxxx","xxxxxxxxx","2694000,2694016,","biuro@wintergroup.pl",null,"PL5482662020",null,"X","X"]
[26010095,"AG",null,"xxxxxxxxx","xxxxxxxxx","2694000,2694025,","oferta@sporto.com.pl",662330222,"PL6751221667",null,null,"X"]
[26010729,"AG",null,"xxxxxxxxx","xxxxxxxxx","2694000,2694025,","biuro@naukatenisa.org","505 946 508",null,null,null,"X"]
[26011730,"AG",null,"xxxxxxxxx","xxxxxxxxx","2694000,2694050,","paulwojcik@poczta.onet.pl","603 915 689","PL6771561478",null,null,"X"]
[26011296,"AG",null,"xxxxxxxxx","xxxxxxxxx","2694000,2694025,","w.adameksport@gmail.com",null,"PL9570926265",null,"X","X"]
[26010840,"AG",null,"xxxxxxxxx","xxxxxxxxx","2694000,2694025,","sklep@boardserwis.pl","22 6160419","PL8671429088",null,"X","X"]
[26010572,"AG",null,"xxxxxxxxx","xxxxxxxxx","2694000,2694025,","mziomber@sac.pl",null,null,null,null,"X"]
[26010621,"AG",null,"xxxxxxxxx","xxxxxxxxx","2694000,2694025,","sklep@wsolsport.pl",null,null,null,"X","X"]
[26010379,"AG",null,"xxxxxxxxx","xxxxxxxxx","2694000,2694016,","info@qbl.pl",507017725,null,null,null,"X"]
[26010393,"AG",null,"xxxxxxxxx","xxxxxxxxx","2694000,2694017,","biuro@wsqn.pl","12 261-17-49","PL6772370289",null,null,"X"]
[26010114,"AG",null,"xxxxxxxxx","xxxxxxxxx","2694000,2694025,","a.wygoda@wygodatravel.pl",502424044,"PL6762360510",null,null,"X"]
[26010388,"AG",null,"xxxxxxxxx","xxxxxxxxx","2694000,2694017,","gasienicakleryk@gmail.com",603754431,"PL5521300606",null,null,"X"]
[26010003,"AG",null,"xxxxxxxxx","xxxxxxxxx","2694000,2694017,","uwalusia@bialkatatrzanska.com",601207198,"PL7361410349",null,"X","X"]
[26010416,"AG",null,"xxxxxxxxx","xxxxxxxxx","2694000,2694016,","skielita@op.pl","603 789 077",null,null,null,"X"]
[26011524,"AG",null,"xxxxxxxxx","xxxxxxxxx","2694000,2694017,","a.jachymek@poczta.fm","606 317 320","PL6832081259",null,null,"X"]
[26010546,"AG",null,"xxxxxxxxx","xxxxxxxxx","2694000,2694016,","m.liwski@wakeparkwroclaw.pl",601766027,"PL8943018070",null,null,"X"]
[26010863,"AG",null,"xxxxxxxxx","xxxxxxxxx","2694000,2694016,","m.liwski@wakeparkwroclaw.pl",601766027,null,null,null,"X"]
[26011847,"AG",null,"xxxxxxxxx","xxxxxxxxx","2694000,2694016,","wisnioswaldemar@gmail.com",608152130,null,null,null,"X"]
[26012092,"AG",null,"xxxxxxxxx","xxxxxxxxx","2694000,2694017,","knowobilska@onet.pl","788 946 476","PL7361745452",null,null,"X"]
[26012059,"AG",null,"xxxxxxxxx","xxxxxxxxx","2694000,2694025,","marcin.potrzebowski@pfpadla.pl","607 576 322",null,null,null,"X"]
[26010252,"AG",null,"xxxxxxxxx","xxxxxxxxx","2694000,2694017,","tomasz.fabisiewicz@deski.org",601083504,"PL5261641025",null,"X","X"]
[26011594,"AG",null,"xxxxxxxxx","xxxxxxxxx","2694000,2694050,","tomektennis@poczta.fm","515 043 799",null,null,null,"X"]
[26010742,"AG",null,"xxxxxxxxx","xxxxxxxxx","2694000,2694050,","m.pociej@op.pl","601 207 101",null,null,null,"X"]
[26010190,"AG",null,"xxxxxxxxx","xxxxxxxxx","2694000,2694016,","klub@poznan-ski.pl",602626988,null,null,null,"X"]
[26010862,"AG",null,"xxxxxxxxx","xxxxxxxxx","2694000,2694017,","piotr.szybkowski@wp.pl",603125547,null,null,null,"X"]
[26010983,"AG",null,"xxxxxxxxx","xxxxxxxxx","2694000,2694017,","mateusz.formela@gmail.com",null,"PL5931471098",null,null,"X"]
[26011102,"AG",null,"xxxxxxxxx","xxxxxxxxx","2694000,2694025,","wieslaw.jachec@hotelracibor.pl","694-410-888",null,null,null,"X"]
[26011756,"AG",null,"xxxxxxxxx","xxxxxxxxx","2694000,2694050,","Urbanowicz@op.pl","504 045 156",null,null,null,"X"]
[26010110,"AG",null,"xxxxxxxxx","xxxxxxxxx","2694000,2694017,","Faktura@windsport.pl",601867267,"PL6760030978",null,"X","X"]
[26011703,"AG",null,"xxxxxxxxx","xxxxxxxxx","2694000,2694016,","sklep@rossignol-outlet.pl","506 112 280","PL5542974959",null,null,"X"]
[26010832,"AG",null,"xxxxxxxxx","xxxxxxxxx","2694000,2694017,","sklep@bluezonesport.pl",338420758,"PL5492211974",null,null,"X"]
[26010939,"AG",null,"xxxxxxxxx","xxxxxxxxx","2694000,2694015,","Witold.korczyc@gmail.com","603 689 690",null,null,null,"X"]
[26011165,"AG",null,"xxxxxxxxx","xxxxxxxxx","2694000,2694025,","kubus.81@gmail.com","608 361 814",null,null,null,"X"]
[26010817,"AG",null,"xxxxxxxxx","xxxxxxxxx","2694000,2694025,","w.bigo@podatki.biz",501497562,null,null,null,"X"]
[26010531,"AG",null,"xxxxxxxxx","xxxxxxxxx","2694000,2694017,","wojciech.bukowiecki@gmail.com",null,null,null,null,"X"]
[26011099,"AG",null,"xxxxxxxxx","xxxxxxxxx","2694000,2694016,","wojtekbebenek@gmail.com","603 839 409",null,null,null,"X"]
[26011003,"AG",null,"xxxxxxxxx","xxxxxxxxx","2694000,2694050,","dynowski.w@poczta.fm","512 225 275",null,null,null,"X"]
[26010658,"AG",null,"xxxxxxxxx","xxxxxxxxx","2694000,2694025,","wojtekjamroz@wp.pl","601 569 262",null,null,null,"X"]
[26011658,"AG",null,"xxxxxxxxx","xxxxxxxxx","2694000,2694017,","wjedrol@op.pl","606 421 023",null,null,null,"X"]
[26010764,"AG",null,"xxxxxxxxx","xxxxxxxxx","2694000,2694017,","wojciechkiszela@gmail.com",502238095,"PL7361054185",null,"X","X"]
[26011611,"AG",null,"xxxxxxxxx","xxxxxxxxx","2694000,2694016,","wojtekubiela@gmail.com",603228285,null,null,null,"X"]
[26011072,"AG",null,"xxxxxxxxx","xxxxxxxxx","2694000,2694050,","w.lang@langiwspolnicy.pl","509 203 252",null,null,null,"X"]
[26010962,"AG",null,"xxxxxxxxx","xxxxxxxxx","2694000,2694025,","mwojtek1@op.pl","501 515 579",null,null,null,"X"]
[26011772,"AG",null,"xxxxxxxxx","xxxxxxxxx","2694000,2694016,","szamek1@gmail.com","+48 509100069",null,null,null,"X"]
[26011126,"AG",null,"xxxxxxxxx","xxxxxxxxx","2694000,2694016,","wojtek@ski4you.pl","+48 504 180 085","PL6111493865",null,"X","X"]
[26010541,"AG",null,"xxxxxxxxx","xxxxxxxxx","2694000,2694017,","w.ziobrowski@op.pl",604781544,null,null,"X","X"]
[26011590,"AG",null,"xxxxxxxxx","xxxxxxxxx","2694000,2694025,","a.wygoda@wygodatravel.pl","502 424 044","PL9441055153",null,null,"X"]
[26011866,"AG",null,"xxxxxxxxx","xxxxxxxxx","2694000,2694017,","anita60@op.pl","733 927 888","PL7361646827",null,null,"X"]
[26011015,"AG",null,"xxxxxxxxx","xxxxxxxxx","2694000,2694016,","darekzajac0@op.pl",600835021,null,null,null,"X"]
[26011867,"AG",null,"xxxxxxxxx","xxxxxxxxx","2694000,2694017,","agd.rtv.talar@op.pl",609530300,"PL7343553222",null,null,"X"]
[26010224,"AG",null,"xxxxxxxxx","xxxxxxxxx","2694000,2694016,","tomek@wysocki-ski.pl",531000016,"PL8512161236",null,null,"X"]
[26011106,"AG",null,"xxxxxxxxx","xxxxxxxxx","2694000,2694016,","anna.wojcik.ns@wp.pl","602 781 711",null,null,null,"X"]
[26010327,"AG",null,"xxxxxxxxx","xxxxxxxxx","2694000,2694025,","wasekkris@poczta.onet.pl",504283142,"PL5481128175",null,null,"X"]
[26010902,"AG",null,"xxxxxxxxx","xxxxxxxxx","2694000,2694025,","wsredniawa@gmail.com","602 302 822",null,null,null,"X"]
[26011876,"AG",null,"xxxxxxxxx","xxxxxxxxx","2694000,2694025,","mariusz.wlodarczyk@stamarw.com.pl","601 475 018",null,null,"X","X"]
[26010833,"AG",null,"xxxxxxxxx","xxxxxxxxx","2694000,2694016,","xsport@x-sport.pl","634 24 00 906","PL6342400906",null,"X","X"]
[26011151,"AG",null,"xxxxxxxxx","xxxxxxxxx","2694000,2694016,","biuro@swiatprzygody.pl","+48 662 681 680","PL5482663232",null,null,"X"]
[26011994,"AG",null,"xxxxxxxxx","xxxxxxxxx","2694000,2694016,","kontakt@zgorky.pl",790682146,null,null,null,"X"]
[26011117,"AG",null,"xxxxxxxxx","xxxxxxxxx","2694000,2694016,","zigipiotrzegadlo@gmail.com","601 165 315",null,null,null,"X"]
[26010158,"AG",null,"xxxxxxxxx","xxxxxxxxx","2694000,2694016,","kmmkrysmal@gmail.com",606124108,"PL7351004487",null,null,"X"]
[26010988,"AG",null,"xxxxxxxxx","xxxxxxxxx","2694000,2694025,","kaamil.dudek@gmail.com","602-691-200","PL6340006453",null,null,"X"]
[26010584,"AG",null,"xxxxxxxxx","xxxxxxxxx","2694000,2694016,","info@stanislawski-sport.com","604 260 055","PL5470044693",null,null,"X"]
[26010912,"AG",null,"xxxxxxxxx","xxxxxxxxx","2694000,2694025,","Jz.jzalewski@gmail.com","600 044 176",null,null,null,"X"]
[26010839,"AG",null,"xxxxxxxxx","xxxxxxxxx","2694000,2694016,","mz@tatraice.com",519339109,null,null,null,"X"]
[26010537,"AG",null,"xxxxxxxxx","xxxxxxxxx","2694000,2694016,","bzfraczek@wp.pl","602 605 475",null,null,null,"X"]
[26011401,"AG",null,"xxxxxxxxx","xxxxxxxxx","2694000,2694016,","gimnazjum@istebna.com",48601772264,null,null,null,"X"]
[26010779,"AG",null,"xxxxxxxxx","xxxxxxxxx","2694000,2694017,","ulawasowicz@gmail.com","664 978 068",null,null,null,"X"]
[26011902,"AG",null,"xxxxxxxxx","xxxxxxxxx","2694000,2694025,","lukasz.sek@onet.pl",506694877,null,null,null,"X"]
[26011612,"AG",null,"xxxxxxxxx","xxxxxxxxx","2694000,2694025,","z.piorkowska95@gmail.com","575 113 970",null,null,null,"X"]
[26011457,"AG",null,"xxxxxxxxx","xxxxxxxxx","2694000,2694050,","zogaba@poczta.onet.pl","519 107 188",null,null,null,"X"]
[26011941,"AG",null,"xxxxxxxxx","xxxxxxxxx","2694000,2694025,","zuziafranko@gmail.com","512 734 387",null,null,null,"X"]
[26010550,"AG",null,"xxxxxxxxx","xxxxxxxxx","2694000,2694050,","tomasz.wilk.35@wp.pl","784 308 903",null,null,null,"X"]
[26010938,"AG",null,"xxxxxxxxx","xxxxxxxxx","2694000,2694017,","zuzanna.witych@gmail.com",660825464,null,null,null,"X"]
[26012027,"AG",null,"xxxxxxxxx","xxxxxxxxx","2694000,2694025,","lukasz.sek@onet.pl",506694877,"PL9291859280",null,null,"X"]
[26011983,"AG",null,"xxxxxxxxx","xxxxxxxxx","2694000,2694017,","paulina@boboski.com",48605954473,"PL5271697004",null,null,"X"]
[26010093,"AG",null,"xxxxxxxxx","xxxxxxxxx","2694000,2694016,","przemyslav.novak@gmail.com",695996024,null,null,"X","X"]
[26012073,"AG",null,"xxxxxxxxx","xxxxxxxxx","2694000,2694025,","rezerwacje@tennis4you.pl","533-997-989","PL8451705149",null,null,"X"]
[26010761,"AG",null,"xxxxxxxxx","xxxxxxxxx","2694000,2694017,","olison80@gmail.com",781481478,"PL5213614786",null,"X","X"]
[26011726,"AG",null,"xxxxxxxxx","xxxxxxxxx","2694000,2694016,","bss.snb.ski@gmail.com","501 820 960",null,null,null,"X"]
[26010835,"AG",null,"xxxxxxxxx","xxxxxxxxx","2694000,2694025,","info@m2000.pl","501 160 522","PL5261055681",null,"X","X"]
[26010509,"AG",null,"xxxxxxxxx","xxxxxxxxx","2694000,2694017,","skirace@skirace.pl",48608502200,"PL8150007462",null,"X","X"]
[26010430,"AG",null,"xxxxxxxxx","xxxxxxxxx","2694000,2694025,","info@squash24.pl","502 374 639",null,null,null,"X"]
[26010867,"AG",null,"xxxxxxxxx","xxxxxxxxx","2694000,2694050,","pj.motylewski@gmail.com","509 509 368",null,null,null,"X"]
[26011026,"AG",null,"xxxxxxxxx","xxxxxxxxx","2694000,2694025,","sklep@sklepzdeskami.pl","694 913 010","PL7811786400",null,null,"X"]
[26011228,"AG",null,"xxxxxxxxx","xxxxxxxxx","2694000,2694016,","walkesport@gmail.com","603-127-129","PL6311520897",null,null,"X"]
[26011366,"AG",null,"xxxxxxxxx","xxxxxxxxx","2694000,2694015,","blazowski.lukasz@gmail.com",606391090,null,null,null,"X"]
[26010926,"AG",null,"xxxxxxxxx","xxxxxxxxx","2694000,2694025,","lcyranski@gmail.com","601 311 546",null,null,null,"X"]
[26010814,"AG",null,"xxxxxxxxx","xxxxxxxxx","2694000,2694025,","lukaszjuzwa@gmail.com","606 251 989",null,null,null,"X"]
[26010872,"AG",null,"xxxxxxxxx","xxxxxxxxx","2694000,2694025,","lukaszjuzwa@gmail.com","606 251 989","PL6312580223",null,"X","X"]
[26010574,"AG",null,"xxxxxxxxx","xxxxxxxxx","2694000,2694025,","lukaszkaminski@op.pl","603 78 38 48",null,null,null,"X"]
[26010760,"AG",null,"xxxxxxxxx","xxxxxxxxx","2694000,2694025,","lucas.squashtrainer@gmail.com",510148530,null,null,null,"X"]
[26010556,"AG",null,"xxxxxxxxx","xxxxxxxxx","2694000,2694025,","luk.kolodziej@gmail.com",null,null,null,null,"X"]
[26011358,"AG",null,"xxxxxxxxx","xxxxxxxxx","2694000,2694016,","pawel@lechsport.pl",613150591000,"PL6131505910",null,null,"X"]
[26011644,"AG",null,"xxxxxxxxx","xxxxxxxxx","2694000,2694050,","trenejros@icloud.com","502 509 470",null,null,null,"X"]
[26011164,"AG",null,"xxxxxxxxx","xxxxxxxxx","2694000,2694050,","madziaw@hotmail.com","694 922 218",null,null,"X","X"]
[26010407,"AG",null,"xxxxxxxxx","xxxxxxxxx","2694000,2694017,","ewarabka2@interia.pl","+48 604 448784",null,null,null,"X"]
[26011211,"AG",null,"xxxxxxxxx","xxxxxxxxx","2694000,2694025,","lukasz.luczakiewicz@konicaminolta.pl","664 152 106",null,null,null,"X"]
[26011297,"AG",null,"xxxxxxxxx","xxxxxxxxx","2694000,2694025,","office@reform.pl","501 127 337",null,null,null,"X"]
[26010744,"AG",null,"xxxxxxxxx","xxxxxxxxx","2694000,2694025,","w.marcol@onet.pl",501457358,null,null,null,"X"]
[26011511,"AG",null,"xxxxxxxxx","xxxxxxxxx","2694000,2694016,","andrzej.wasowicz@pzn.pl","508 119 700","PL5471663004",null,null,"X"]
[26010838,"AG",null,"xxxxxxxxx","xxxxxxxxx","2694000,2694025,","mateuszkord@gmail.com",502470076,null,null,null,"X"]
[26011223,"AG",null,"xxxxxxxxx","xxxxxxxxx","2694000,2694017,","sklep@swiatnart.com.pl",606350314,"PL1250491399",null,"X","X"]
[26010516,"AG",null,"xxxxxxxxx","xxxxxxxxx","2694000,2694016,","filip.jagla@gmail.com",603791680,null,null,null,"X"]
[26010489,"WE",260190270,"xxxxxxxxx","xxxxxxxxx","2694000,2694025,"]
[26010763,"WE",260190833,"xxxxxxxxx","xxxxxxxxx","2694000,2694025,","raszka@rubikon.pl"]
[26010028,"WE",260190447,"xxxxxxxxx","xxxxxxxxx","2694000,2694016,","sklep@2bsport.pl"]
[26011529,"WE",260190990,"xxxxxxxxx","xxxxxxxxx","2694000,2694025,","info@3surf.pl"]
[26010316,"WE",260190658,"xxxxxxxxx","xxxxxxxxx","2694000,2694017,","poznan@4faces.com.pl"]
[26010316,"WE",260190571,"xxxxxxxxx","xxxxxxxxx","2694000,2694017,","fka1@4faces.com.pl"]
[26010316,"WE",260190680,"xxxxxxxxx","xxxxxxxxx","2694000,2694017,","warszawa@4faces.com.pl"]
[26010861,"WE",260190752,"xxxxxxxxx","xxxxxxxxx","2694000,2694017,","info@abcsurf.pl"]
[26010234,"WE",260190493,"xxxxxxxxx","xxxxxxxxx","2694000,2694025,","czile@interia.pl"]
[26011033,"WE",260190756,"xxxxxxxxx","xxxxxxxxx","2694000,2694017,","info@aktiv-sport.pl"]
[26011033,"WE",260190683,"xxxxxxxxx","xxxxxxxxx","2694000,2694017,","wiertnicza@aktiv-sport.pl"]
[26010844,"WE",260190753,"xxxxxxxxx","xxxxxxxxx","2694000,2694017,","altsport@altsport.pl"]
[26010676,"WE",260190362,"xxxxxxxxx","xxxxxxxxx","2694000,2694025,"]
[26010713,"WE",260190405,"xxxxxxxxx","xxxxxxxxx","2694000,2694025,"]
[26010306,"WE",260190819,"xxxxxxxxx","xxxxxxxxx","2694000,2694025,","biuro@atppro.pl"]
[26010306,"WE",260190512,"xxxxxxxxx","xxxxxxxxx","2694000,2694025,","biuro@atppro.pl"]
[26010306,"WE",260190513,"xxxxxxxxx","xxxxxxxxx","2694000,2694025,","zachodnia@atppro.pl"]
[26010306,"WE",260190726,"xxxxxxxxx","xxxxxxxxx","2694000,2694025,","biuro@atppro.pl"]
[26011556,"WE",260190996,"xxxxxxxxx","xxxxxxxxx","2694000,2694017,","sklep@nartyrowerykrakow.pl"]
[26012026,"WE",260191320,"xxxxxxxxx","xxxxxxxxx","2694000,2694016,","kontakt@activetime24.com"]
[26012026,"WE",260191263,"xxxxxxxxx","xxxxxxxxx","2694000,2694016,","kontakt@activetime24.com"]
[26010252,"WE",260190099,"xxxxxxxxx","xxxxxxxxx","2694000,2694017,","a.fronczak@wp.pl"]
[26012136,"WE",260191264,"xxxxxxxxx","xxxxxxxxx","2694000,2694025,","adampajestka@tlen.pl"]
[26012087,"WE",260191264,"xxxxxxxxx","xxxxxxxxx","2694000,2694025,","adampajestka@tlen.pl"]
[26012017,"WE",260191264,"xxxxxxxxx","xxxxxxxxx","2694000,2694025,","adampajestka@tlen.pl"]
[26011775,"WE",260191127,"xxxxxxxxx","xxxxxxxxx","2694000,2694025,","arysz08@gmail.com"]
[26011317,"WE",260190876,"xxxxxxxxx","xxxxxxxxx","2694000,2694025,","office@reform.pl"]
[26011333,"WE",260190887,"xxxxxxxxx","xxxxxxxxx","2694000,2694025,","akademiatenisamm@gmail.com"]
[26010984,"WE",260190670,"xxxxxxxxx","xxxxxxxxx","2694000,2694025,","lech.sidor@legia.pl"]
[26010330,"WE",260190022,"xxxxxxxxx","xxxxxxxxx","2694000,2694017,"]
[26011335,"WE",260191362,"xxxxxxxxx","xxxxxxxxx","2694000,2694016,","biuro@nartus.pl"]
[26010776,"WE",260190541,"xxxxxxxxx","xxxxxxxxx","2694000,2694017,","sklep@amazing.pl"]
[26012140,"WE",260191365,"xxxxxxxxx","xxxxxxxxx","2694000,2694025,","andrzejgronowski@gmail.com"]
[26011859,"WE",260191340,"xxxxxxxxx","xxxxxxxxx","2694000,2694016,","andrzej-romanski@wp.pl"]
[26011261,"WE",260190862,"xxxxxxxxx","xxxxxxxxx","2694000,2694025,","andrzej.rosol@gmail.com"]
[26010991,"WE",260190659,"xxxxxxxxx","xxxxxxxxx","2694000,2694025,","astra22@onet.eu"]
[26010542,"WE",260190310,"xxxxxxxxx","xxxxxxxxx","2694000,2694025,","anetasitarz@gmail.com"]
[26010303,"WE",260190054,"xxxxxxxxx","xxxxxxxxx","2694000,2694017,"]
[26010337,"WE",260190023,"xxxxxxxxx","xxxxxxxxx","2694000,2694017,","Anna.Maslyk@intersport.pl"]
[26011182,"WE",260190997,"xxxxxxxxx","xxxxxxxxx","2694000,2694017,","asiaski24@gmail.com"]
[26011226,"WE",260190788,"xxxxxxxxx","xxxxxxxxx","2694000,2694017,","biuro@axel-sport.pl"]
[26011525,"WE",260190954,"xxxxxxxxx","xxxxxxxxx","2694000,2694017,","tarnowkrk_axelsport@interia.pl"]
[26012121,"WE",260191355,"xxxxxxxxx","xxxxxxxxx","2694000,","sadowska.beata@gmail.com"]
[26010391,"WE",260190444,"xxxxxxxxx","xxxxxxxxx","2694000,2694016,","sklep@bikesystem.pl"]
[26011842,"WE",260191292,"xxxxxxxxx","xxxxxxxxx","2694000,2694017,","serwis@bikeandski.pl"]
[26010087,"WE",260190227,"xxxxxxxxx","xxxxxxxxx","2694000,2694017,","katowice@bikershop.pl"]
[26010087,"WE",260190226,"xxxxxxxxx","xxxxxxxxx","2694000,2694017,","krakow@bikershop.pl"]
[26010087,"WE",260190228,"xxxxxxxxx","xxxxxxxxx","2694000,2694017,","nowysacz@bikershop.pl"]
[26010682,"WE",260190825,"xxxxxxxxx","xxxxxxxxx","2694000,2694025,","wojciech.wrzol@bdm.pl"]
[26010278,"WE",260190517,"xxxxxxxxx","xxxxxxxxx","2694000,2694016,","sklepbrossport@gmail.com"]
[26012098,"WE",260191356,"xxxxxxxxx","xxxxxxxxx","2694000,2694025,","biuro@bazasportgdynia.pl"]
[26011777,"WE",260191160,"xxxxxxxxx","xxxxxxxxx","2694000,2694025,","smolinb@gmail.com"]
[26010654,"WE",260191124,"xxxxxxxxx","xxxxxxxxx","2694000,2694016,","szkola@ptak-team.pl"]
[26010264,"WE",260190595,"xxxxxxxxx","xxxxxxxxx","2694000,2694016,","biuro@nova.szczyrk.pl"]
[26011148,"WE",260191082,"xxxxxxxxx","xxxxxxxxx","2694000,2694017,","sklep.katowice@bikershop.pl"]
[26011148,"WE",260190912,"xxxxxxxxx","xxxxxxxxx","2694000,2694017,","sportownia.nowysacz@gmail.com"]
[26011356,"WE",260190953,"xxxxxxxxx","xxxxxxxxx","2694000,2694017,","sklep.bikeshop@gmail.com"]
[26010429,"WE",260190231,"xxxxxxxxx","xxxxxxxxx","2694000,2694017,"]
[26010840,"WE",260190801,"xxxxxxxxx","xxxxxxxxx","2694000,2694025,","sklep@boardserwis.pl"]
[26010974,"WE",260190669,"xxxxxxxxx","xxxxxxxxx","2694000,2694016,","pietrykowski@gmail.com"]
[26011471,"WE",260190946,"xxxxxxxxx","xxxxxxxxx","2694000,2694025,","bernatowicz.d@gmail.com"]
[26011508,"WE",260190972,"xxxxxxxxx","xxxxxxxxx","2694000,2694025,","kontakt@blonia-sport.pl"]
[26010024,"WE",260190330,"xxxxxxxxx","xxxxxxxxx","2694000,2694016,","sklep@centrumrowerowe.pl"]
[26010177,"WE",260190328,"xxxxxxxxx","xxxxxxxxx","2694000,2694017,","mariusz@chlebeksport.pl"]
[26010177,"WE",260190485,"xxxxxxxxx","xxxxxxxxx","2694000,2694017,","pytania@chlebek-sport.pl"]
[26010177,"WE",260190486,"xxxxxxxxx","xxxxxxxxx","2694000,2694017,"]
[26010177,"WE",260190545,"xxxxxxxxx","xxxxxxxxx","2694000,2694017,","pytania@chlebek-sport.pl"]
[26010076,"WE",260190118,"xxxxxxxxx","xxxxxxxxx","2694000,2694017,","cyclocentrumsc@poczta.onet.pl"]
[26010649,"WE",260191022,"xxxxxxxxx","xxxxxxxxx","2694000,2694050,","zgola@canpol.poznan.pl"]
[26010156,"WE",260190220,"xxxxxxxxx","xxxxxxxxx","2694000,2694025,"]
[26010486,"WE",260190272,"xxxxxxxxx","xxxxxxxxx","2694000,2694016,","bikeandmike@googlemail.com"]
[26011699,"WE",260191087,"xxxxxxxxx","xxxxxxxxx","2694000,2694025,","sklep@come-on.pl"]
[26011837,"WE",260191169,"xxxxxxxxx","xxxxxxxxx","2694000,2694025,","tenis@come-on.pl"]
[26010326,"WE",260190492,"xxxxxxxxx","xxxxxxxxx","2694000,2694017,","magazyn@coolsport.pl"]
[26010076,"WE",260190556,"xxxxxxxxx","xxxxxxxxx","2694000,2694017,","borysswic@gmail.com"]
[26011472,"WE",260190947,"xxxxxxxxx","xxxxxxxxx","2694000,2694017,","sklep@galeriasportowa.com"]
[26010746,"WE",260190409,"xxxxxxxxx","xxxxxxxxx","2694000,2694017,","piotr@dobrenarty.pl"]
[26010746,"WE",260190765,"xxxxxxxxx","xxxxxxxxx","2694000,2694017,","krakow@dobrenarty.pl"]
[26011076,"WE",260190713,"xxxxxxxxx","xxxxxxxxx","2694000,2694025,","darek@preisler.pl"]
[26011593,"WE",260191033,"xxxxxxxxx","xxxxxxxxx","2694000,2694025,","visionclub.tenis@gmail.com"]
[26010948,"WE",260190983,"xxxxxxxxx","xxxxxxxxx","2694000,2694015,"]
[26010948,"WE",260190628,"xxxxxxxxx","xxxxxxxxx","2694000,2694015,"]
[26010948,"WE",260190629,"xxxxxxxxx","xxxxxxxxx","2694000,2694015,"]
[26010102,"WE",260190521,"xxxxxxxxx","xxxxxxxxx","2694000,2694025,","kontakt@dotenisa.pl"]
[26011526,"WE",260190521,"xxxxxxxxx","xxxxxxxxx","2694000,2694025,","kontakt@dotenisa.pl"]
[26011094,"WE",260190915,"xxxxxxxxx","xxxxxxxxx","2694000,2694017,","doboszsport@gmail.com"]
[26011066,"WE",260190763,"xxxxxxxxx","xxxxxxxxx","2694000,2694016,","sklep@dobrazima.pl"]
[26010014,"WE",260190445,"xxxxxxxxx","xxxxxxxxx","2694000,2694016,","sklep@ekspert-sport.pl"]
[26010004,"WE",260190476,"xxxxxxxxx","xxxxxxxxx","2694000,2694017,","biuro@emes-sport.pl"]
[26010282,"WE",260190424,"xxxxxxxxx","xxxxxxxxx","2694000,2694016,","sklep@emisurf.pl"]
[26011304,"WE",260191186,"xxxxxxxxx","xxxxxxxxx","2694000,2694016,","info@eobuwie.pl"]
[26010245,"WE",260190520,"xxxxxxxxx","xxxxxxxxx","2694000,2694025,","sklep@erakiety.com"]
[26010102,"WE",260190520,"xxxxxxxxx","xxxxxxxxx","2694000,2694025,","sklep@erakiety.com"]
[26010014,"WE",260190111,"xxxxxxxxx","xxxxxxxxx","2694000,2694016,","ekoekspert@go2.pl"]
[26010139,"WE",260190764,"xxxxxxxxx","xxxxxxxxx","2694000,2694016,","info@energysports.pl"]
[26011386,"WE",260190922,"xxxxxxxxx","xxxxxxxxx","2694000,2694025,","kontakt@enjoysquashkrakow.pl"]
[26010876,"WE",260190643,"xxxxxxxxx","xxxxxxxxx","2694000,2694025,","agnieszka.wajdemajer@gmail.com"]
[26010320,"WE",260191080,"xxxxxxxxx","xxxxxxxxx","2694000,2694016,"]
[26010668,"WE",260190999,"xxxxxxxxx","xxxxxxxxx","2694000,2694025,","michal.kostecki1@gmail.com"]
[26010189,"WE",260190441,"xxxxxxxxx","xxxxxxxxx","2694000,2694016,","info@familisport.pl"]
[26010202,"WE",260190463,"xxxxxxxxx","xxxxxxxxx","2694000,2694017,","sport@fan-sport.pl"]
[26011131,"WE",260190744,"xxxxxxxxx","xxxxxxxxx","2694000,2694017,","hudinikaz@op.pl"]
[26010037,"WE",260190518,"xxxxxxxxx","xxxxxxxxx","2694000,2694016,","sklep@forehand.pl"]
[26011077,"WE",260190716,"xxxxxxxxx","xxxxxxxxx","2694000,2694025,","j.marcinkowski@fairplayce.pl"]
[26010985,"WE",260190816,"xxxxxxxxx","xxxxxxxxx","2694000,2694016,","fansport@fansport.gliwice.pl"]
[26011430,"WE",260190940,"xxxxxxxxx","xxxxxxxxx","2694000,2694017,","rezerwacja@pensjonat-silverton.pl"]
[26011301,"WE",260191028,"xxxxxxxxx","xxxxxxxxx","2694000,2694025,","patmaj91@gmail.com"]
[26010113,"WE",260190092,"xxxxxxxxx","xxxxxxxxx","2694000,2694025,"]
[26011261,"WE",260190875,"xxxxxxxxx","xxxxxxxxx","2694000,2694025,"]
[26011413,"WE",260191182,"xxxxxxxxx","xxxxxxxxx","2694000,2694050,","wrobeg@gmail.com"]
[26011752,"WE",260191136,"xxxxxxxxx","xxxxxxxxx","2694000,2694025,","kontakt@gemsetmecz.com.pl"]
[26010273,"WE",260190372,"xxxxxxxxx","xxxxxxxxx","2694000,2694015,"]
[26010273,"WE",260190415,"xxxxxxxxx","xxxxxxxxx","2694000,2694015,"]
[26010273,"WE",260190418,"xxxxxxxxx","xxxxxxxxx","2694000,2694015,"]
[26010273,"WE",260190379,"xxxxxxxxx","xxxxxxxxx","2694000,2694015,"]
[26010273,"WE",260190373,"xxxxxxxxx","xxxxxxxxx","2694000,2694015,"]
[26010273,"WE",260190377,"xxxxxxxxx","xxxxxxxxx","2694000,2694015,"]
[26010273,"WE",260190378,"xxxxxxxxx","xxxxxxxxx","2694000,2694015,"]
[26010273,"WE",260190416,"xxxxxxxxx","xxxxxxxxx","2694000,2694015,"]
[26010273,"WE",260190374,"xxxxxxxxx","xxxxxxxxx","2694000,2694015,"]
[26010273,"WE",260190375,"xxxxxxxxx","xxxxxxxxx","2694000,2694015,"]
[26010273,"WE",260190376,"xxxxxxxxx","xxxxxxxxx","2694000,2694015,"]
[26010273,"WE",260190417,"xxxxxxxxx","xxxxxxxxx","2694000,2694015,"]
[26010273,"WE",260190420,"xxxxxxxxx","xxxxxxxxx","2694000,2694015,"]
[26010273,"WE",260190419,"xxxxxxxxx","xxxxxxxxx","2694000,2694015,"]
[26010273,"WE",260190795,"xxxxxxxxx","xxxxxxxxx","2694000,2694015,"]
[26010273,"WE",260190391,"xxxxxxxxx","xxxxxxxxx","2694000,2694015,"]
[26010273,"WE",260190396,"xxxxxxxxx","xxxxxxxxx","2694000,2694015,"]
[26010273,"WE",260190386,"xxxxxxxxx","xxxxxxxxx","2694000,2694015,"]
[26010273,"WE",260190398,"xxxxxxxxx","xxxxxxxxx","2694000,2694015,"]
[26010273,"WE",260190393,"xxxxxxxxx","xxxxxxxxx","2694000,2694015,"]
[26010273,"WE",260190392,"xxxxxxxxx","xxxxxxxxx","2694000,2694015,"]
[26010273,"WE",260190390,"xxxxxxxxx","xxxxxxxxx","2694000,2694015,"]
[26010273,"WE",260190400,"xxxxxxxxx","xxxxxxxxx","2694000,2694015,"]
[26010273,"WE",260190394,"xxxxxxxxx","xxxxxxxxx","2694000,2694015,"]
[26010273,"WE",260190397,"xxxxxxxxx","xxxxxxxxx","2694000,2694015,"]
[26010273,"WE",260190388,"xxxxxxxxx","xxxxxxxxx","2694000,2694015,"]
[26010273,"WE",260190399,"xxxxxxxxx","xxxxxxxxx","2694000,2694015,"]
[26010273,"WE",260190389,"xxxxxxxxx","xxxxxxxxx","2694000,2694015,"]
[26010273,"WE",260190395,"xxxxxxxxx","xxxxxxxxx","2694000,2694015,"]
[26010273,"WE",260190387,"xxxxxxxxx","xxxxxxxxx","2694000,2694015,"]
[26010137,"WE",260190439,"xxxxxxxxx","xxxxxxxxx","2694000,2694016,","sklep@goldsport.pl"]
[26010137,"WE",260190116,"xxxxxxxxx","xxxxxxxxx","2694000,2694016,","sklep@goldsport.pl"]
[26011299,"WE",260190861,"xxxxxxxxx","xxxxxxxxx","2694000,2694025,","grabinski.ad@gmail.com"]
[26010413,"WE",260190210,"xxxxxxxxx","xxxxxxxxx","2694000,2694025,"]
[26011243,"WE",260190886,"xxxxxxxxx","xxxxxxxxx","2694000,2694016,"]
[26010649,"WE",260191051,"xxxxxxxxx","xxxxxxxxx","2694000,2694050,"]
[26010424,"WE",260190423,"xxxxxxxxx","xxxxxxxxx","2694000,2694016,","sklep@insport24.pl"]
[26010541,"WE",260190578,"xxxxxxxxx","xxxxxxxxx","2694000,2694017,"]
[26010207,"WE",260190578,"xxxxxxxxx","xxxxxxxxx","2694000,2694017,"]
[187,"WE",260190000,"xxxxxxxxx","xxxxxxxxx","2694000,","p.bek@pl.head.com"]
[26011671,"WE",260191073,"xxxxxxxxx","xxxxxxxxx","2694000,2694017,","przemyslaw@himalayasport.pl"]
[26011671,"WE",260191345,"xxxxxxxxx","xxxxxxxxx","2694000,2694017,","przemyslaw@himalayasport.pl"]
[26012043,"WE",260191310,"xxxxxxxxx","xxxxxxxxx","2694000,2694016,","rafal.lisak@gmail.com"]
[26012028,"WE",260191351,"xxxxxxxxx","xxxxxxxxx","2694000,2694017,","andrzej.hyc@hski.pl"]
[26012028,"WE",260191286,"xxxxxxxxx","xxxxxxxxx","2694000,2694017,"]
[26012094,"WE",260191336,"xxxxxxxxx","xxxxxxxxx","2694000,2694017,","kochancz@agh.edu.pl"]
[26010159,"WE",260190221,"xxxxxxxxx","xxxxxxxxx","2694000,2694016,"]
[26011737,"WE",260191167,"xxxxxxxxx","xxxxxxxxx","2694000,2694016,","bartek@b-good.at"]
[26010025,"WE",260190820,"xxxxxxxxx","xxxxxxxxx","2694000,2694025,","sport@paak.com.pl"]
[26011700,"WE",260191261,"xxxxxxxxx","xxxxxxxxx","2694000,2694017,","INFO@INTERSKI.PL"]
[26011935,"WE",260191316,"xxxxxxxxx","xxxxxxxxx","2694000,2694025,","jacek@interpadel.no"]
[26011935,"WE",260191226,"xxxxxxxxx","xxxxxxxxx","2694000,2694025,","jacek@interpadel.no"]
[26010126,"WE",260190019,"xxxxxxxxx","xxxxxxxxx","2694000,2694015,","plejada.bytom@intersport.pl"]
[26010126,"WE",260190057,"xxxxxxxxx","xxxxxxxxx","2694000,2694015,","arkadia.warszawa@intersport.pl"]
[26010126,"WE",260190083,"xxxxxxxxx","xxxxxxxxx","2694000,2694015,","kaskada.szczecin@intersport.pl"]
[26010126,"WE",260190073,"xxxxxxxxx","xxxxxxxxx","2694000,2694015,","marcelin.poznan@intersport.pl"]
[26010126,"WE",260190058,"xxxxxxxxx","xxxxxxxxx","2694000,2694015,","silesia.katowice@intersport.pl"]
[26010126,"WE",260190081,"xxxxxxxxx","xxxxxxxxx","2694000,2694015,","sloneczna.radom@intersport.pl"]
[26010126,"WE",260190066,"xxxxxxxxx","xxxxxxxxx","2694000,2694015,","baltycka.gdansk@intersport.pl"]
[26010126,"WE",260190070,"xxxxxxxxx","xxxxxxxxx","2694000,2694015,","focuspark.bydgoszcz@intersport.pl"]
[26010126,"WE",260190060,"xxxxxxxxx","xxxxxxxxx","2694000,2694015,","manufaktura.lodz@intersport.pl"]
[26010126,"WE",260190074,"xxxxxxxxx","xxxxxxxxx","2694000,2694015,","wzgorze.gdynia@intersport.pl"]
[26010126,"WE",260190068,"xxxxxxxxx","xxxxxxxxx","2694000,2694015,","magnolia.wroclaw@intersport.pl"]
[26010126,"WE",260190056,"xxxxxxxxx","xxxxxxxxx","2694000,2694015,","sfera.bielsko@intersport.pl"]
[26010126,"WE",260190076,"xxxxxxxxx","xxxxxxxxx","2694000,2694015,","solaris.opole@intersport.pl"]
[26010126,"WE",260190067,"xxxxxxxxx","xxxxxxxxx","2694000,2694015,","sadyba.warszawa@intersport.pl"]
[26010126,"WE",260190064,"xxxxxxxxx","xxxxxxxxx","2694000,2694015,","starybrowar.poznan@intersport.pl"]
[26010126,"WE",260190085,"xxxxxxxxx","xxxxxxxxx","2694000,2694015,","korona.kielce@intersport.pl"]
[26010126,"WE",260190061,"xxxxxxxxx","xxxxxxxxx","2694000,2694015,","madison.gdansk@intersport.pl"]
[26010126,"WE",260190079,"xxxxxxxxx","xxxxxxxxx","2694000,2694015,","bronowice.krakow@intersport.pl"]
[26010126,"WE",260190059,"xxxxxxxxx","xxxxxxxxx","2694000,2694015,","m1.poznan@intersport.pl"]
[26010126,"WE",260190082,"xxxxxxxxx","xxxxxxxxx","2694000,2694015,","wierchy.zakopane@intersport.pl"]
[26010126,"WE",260190401,"xxxxxxxxx","xxxxxxxxx","2694000,2694015,","warminska.olsztyn@intersport.pl"]
[26010126,"WE",260190209,"xxxxxxxxx","xxxxxxxxx","2694000,2694015,","amber.kalisz@intersport.pl"]
[26010126,"WE",260190208,"xxxxxxxxx","xxxxxxxxx","2694000,2694015,","felicity.lublin@intersport.pl"]
[26010126,"WE",260191212,"xxxxxxxxx","xxxxxxxxx","2694000,2694015,","mokotow.warszawa@intersport.pl"]
[26010126,"WE",260190080,"xxxxxxxxx","xxxxxxxxx","2694000,2694015,","wisla.plock@intersport.pl"]
[26010126,"WE",260190018,"xxxxxxxxx","xxxxxxxxx","2694000,2694015,","zakopianka.krakow@intersport.pl"]
[26010126,"WE",260190063,"xxxxxxxxx","xxxxxxxxx","2694000,2694015,","tarasy.warszawa@intersport.pl"]
[26010126,"WE",260190072,"xxxxxxxxx","xxxxxxxxx","2694000,2694015,","pestka.poznan@intersport.pl"]
[26010126,"WE",260190078,"xxxxxxxxx","xxxxxxxxx","2694000,2694015,","jurajska.czestochowa@intersport.pl"]
[26010126,"WE",260190071,"xxxxxxxxx","xxxxxxxxx","2694000,2694015,","millenium.rzeszow@intersport.pl"]
[26010126,"WE",260191213,"xxxxxxxxx","xxxxxxxxx","2694000,2694015,","galeria.katowice@intersport.pl"]
[26010126,"WE",260190633,"xxxxxxxxx","xxxxxxxxx","2694000,2694015,","posnania.poznan@intersport.pl"]
[26010126,"WE",260190084,"xxxxxxxxx","xxxxxxxxx","2694000,2694015,","novapark.gorzow@intersport.pl"]
[26010126,"WE",260190552,"xxxxxxxxx","xxxxxxxxx","2694000,2694015,","posnania.poznan@intersport.pl"]
[26010126,"WE",260191036,"xxxxxxxxx","xxxxxxxxx","2694000,2694015,","polnocna.warszawa@intersport.pl"]
[26010126,"WE",260190075,"xxxxxxxxx","xxxxxxxxx","2694000,2694015,","alfa.bialystok@intersport.pl"]
[26010126,"WE",260190077,"xxxxxxxxx","xxxxxxxxx","2694000,2694015,","alma.lodz@intersport.pl"]
[26010126,"WE",260190062,"xxxxxxxxx","xxxxxxxxx","2694000,2694015,","galeria.krakow@intersport.pl"]
[26010126,"WE",260190069,"xxxxxxxxx","xxxxxxxxx","2694000,2694015,","ursynow.warszawa@intersport.pl"]
[26010126,"WE",260190017,"xxxxxxxxx","xxxxxxxxx","2694000,2694015,","logistykab2b@intersport.pl"]
[26010127,"WE",260190461,"xxxxxxxxx","xxxxxxxxx","2694000,2694017,","sklep@irmaksport.pl"]
[26010108,"WE",260190460,"xxxxxxxxx","xxxxxxxxx","2694000,2694017,","sklep@isport.pl"]
[26011506,"WE",260191040,"xxxxxxxxx","xxxxxxxxx","2694000,2694016,","biuro.wrosport@gmail.com"]
[26011281,"WE",260191120,"xxxxxxxxx","xxxxxxxxx","2694000,2694025,","j.mokryzicki@o2.pl"]
[26010232,"WE",260190449,"xxxxxxxxx","xxxxxxxxx","2694000,2694016,","jtsport@poczta.onet.pl"]
[26011534,"WE",260191305,"xxxxxxxxx","xxxxxxxxx","2694000,2694016,","jacek.rojewski@gmail.com"]
[26011702,"WE",260191083,"xxxxxxxxx","xxxxxxxxx","2694000,2694025,","walekajacek@wp.pl"]
[26011852,"WE",260191180,"xxxxxxxxx","xxxxxxxxx","2694000,2694025,","j.kordasiewicz@icloud.com"]
[26010045,"WE",260190305,"xxxxxxxxx","xxxxxxxxx","2694000,2694017,"]
[26011689,"WE",260191360,"xxxxxxxxx","xxxxxxxxx","2694000,2694017,","jaroslaw.jasica@gmail.com"]
[26010186,"WE",260190995,"xxxxxxxxx","xxxxxxxxx","2694000,2694016,","plas-met@wp.pl"]
[26011937,"WE",260191220,"xxxxxxxxx","xxxxxxxxx","2694000,2694025,","julia.ogorodnik@intersport.pl"]
[26011687,"WE",260191085,"xxxxxxxxx","xxxxxxxxx","2694000,2694016,"]
[26011680,"WE",260191095,"xxxxxxxxx","xxxxxxxxx","2694000,2694025,","biuro@k69.com.pl"]
[26011328,"WE",260191084,"xxxxxxxxx","xxxxxxxxx","2694000,2694016,"]
[26011041,"WE",260190686,"xxxxxxxxx","xxxxxxxxx","2694000,2694025,","sieczny@gmail.com"]
[26010764,"WE",260190527,"xxxxxxxxx","xxxxxxxxx","2694000,2694017,","wojciechkiszela@gmail.com"]
[26010109,"WE",260190464,"xxxxxxxxx","xxxxxxxxx","2694000,2694017,","info@krakowsport.pl"]
[26010109,"WE",260190408,"xxxxxxxxx","xxxxxxxxx","2694000,2694017,","info@krakowsport.pl"]
[26011833,"WE",260191181,"xxxxxxxxx","xxxxxxxxx","2694000,2694025,","igorbujdo@op.pl"]
[26011173,"WE",260190904,"xxxxxxxxx","xxxxxxxxx","2694000,2694025,"]
[26010875,"WE",260190605,"xxxxxxxxx","xxxxxxxxx","2694000,2694025,","ktwschodnia@o2.pl"]
[26010154,"WE",260190481,"xxxxxxxxx","xxxxxxxxx","2694000,2694017,","kuguar.fm@poczta.fm"]
[26010898,"WE",260190607,"xxxxxxxxx","xxxxxxxxx","2694000,2694025,","mofils@vp.pl"]
[26011655,"WE",260191150,"xxxxxxxxx","xxxxxxxxx","2694000,2694025,","kamilprzybitkowski@interia.pl"]
[26010442,"WE",260191061,"xxxxxxxxx","xxxxxxxxx","2694000,2694025,","kamil88rybak@gmail.com"]
[26010361,"WE",260191166,"xxxxxxxxx","xxxxxxxxx","2694000,2694016,","biuro@funrace.pl"]
[26010567,"WE",260191046,"xxxxxxxxx","xxxxxxxxx","2694000,2694016,"]
[26011328,"WE",260190889,"xxxxxxxxx","xxxxxxxxx","2694000,2694016,"]
[26011619,"WE",260191034,"xxxxxxxxx","xxxxxxxxx","2694000,2694025,","kchdomanska@gmail.com"]
[26010715,"WE",260190935,"xxxxxxxxx","xxxxxxxxx","2694000,2694025,2694050,"]
[26011496,"WE",260190951,"xxxxxxxxx","xxxxxxxxx","2694000,2694016,","katarzyna.wasek96@gmail.com"]
[26011496,"WE",260191045,"xxxxxxxxx","xxxxxxxxx","2694000,2694016,"]
[26011668,"WE",260191052,"xxxxxxxxx","xxxxxxxxx","2694000,2694025,"]
[26012033,"WE",260191300,"xxxxxxxxx","xxxxxxxxx","2694000,2694025,","smiglo89@interia.pl"]
[26010124,"WE",260190550,"xxxxxxxxx","xxxxxxxxx","2694000,2694016,","pawel@sporting.com.pl"]
[26012020,"WE",260191293,"xxxxxxxxx","xxxxxxxxx","2694000,2694025,","ktwschodnia@o2.pl"]
[26010918,"WE",260190612,"xxxxxxxxx","xxxxxxxxx","2694000,2694017,"]
[26011668,"WE",260191225,"xxxxxxxxx","xxxxxxxxx","2694000,2694025,","s.anders@lesznotenisklub.pl"]
[26011631,"WE",260191077,"xxxxxxxxx","xxxxxxxxx","2694000,2694025,","uks.tenis24@gmail.com"]
[26011835,"WE",260191231,"xxxxxxxxx","xxxxxxxxx","2694000,2694017,","info@krakowsport.pl"]
[26010329,"WE",260190225,"xxxxxxxxx","xxxxxxxxx","2694000,2694016,"]
[26011851,"WE",260191175,"xxxxxxxxx","xxxxxxxxx","2694000,2694025,","michal.szewc@tenisgolf.legia.com"]
[26010491,"WE",260190471,"xxxxxxxxx","xxxxxxxxx","2694000,2694017,","sklep@locales.com.pl"]
[26011680,"WE",260191079,"xxxxxxxxx","xxxxxxxxx","2694000,2694025,"]
[26010966,"WE",260190657,"xxxxxxxxx","xxxxxxxxx","2694000,2694017,","biuro@nartyprzemysl.pl"]
[26010178,"WE",260190240,"xxxxxxxxx","xxxxxxxxx","2694000,2694025,","cyper@msport.pl"]
[26010285,"WE",260190457,"xxxxxxxxx","xxxxxxxxx","2694000,2694016,","kontakt@marko.wroc.pl"]
[26010011,"WE",260190292,"xxxxxxxxx","xxxxxxxxx","2694000,2694015,","chelm@martessport.com.pl"]
[26010011,"WE",260190622,"xxxxxxxxx","xxxxxxxxx","2694000,2694015,","radom@martessport.com.pl"]
[26010011,"WE",260190604,"xxxxxxxxx","xxxxxxxxx","2694000,2694015,","lodz.pasaz@martessport.com.pl"]
[26010011,"WE",260190532,"xxxxxxxxx","xxxxxxxxx","2694000,2694015,","bielskpodlaski@martessport.com.pl"]
[26010011,"WE",260190160,"xxxxxxxxx","xxxxxxxxx","2694000,2694015,","gorzow@martessport.com.pl"]
[26010011,"WE",260190524,"xxxxxxxxx","xxxxxxxxx","2694000,2694015,","malbork@martessport.com.pl"]
[26010011,"WE",260190175,"xxxxxxxxx","xxxxxxxxx","2694000,2694015,","lublin@maertessport.com.pl"]
[26010011,"WE",260190623,"xxxxxxxxx","xxxxxxxxx","2694000,2694015,","gdynia.klif@martessport.com.pl"]
[26010011,"WE",260191058,"xxxxxxxxx","xxxxxxxxx","2694000,2694015,","mlawa.stacja@martessport.com.pl"]
[26010011,"WE",260190365,"xxxxxxxxx","xxxxxxxxx","2694000,2694015,","jeleniagora@martessport.com.pl"]
[26010011,"WE",260191018,"xxxxxxxxx","xxxxxxxxx","2694000,2694015,","rawamazowiecka@martessport.com.pl"]
[26010011,"WE",260190916,"xxxxxxxxx","xxxxxxxxx","2694000,2694015,","lomza2@martessport.com.pl"]
[26010011,"WE",260190758,"xxxxxxxxx","xxxxxxxxx","2694000,2694015,","lublin.ikea@martessport.com.pl"]
[26010011,"WE",260190653,"xxxxxxxxx","xxxxxxxxx","2694000,2694015,","strzegom@martessport.com.pl"]
[26010011,"WE",260190327,"xxxxxxxxx","xxxxxxxxx","2694000,2694015,","zory@martessport.com.pl"]
[26010011,"WE",260190857,"xxxxxxxxx","xxxxxxxxx","2694000,2694015,","olecko@martessport.com.pl"]
[26010011,"WE",260191023,"xxxxxxxxx","xxxxxxxxx","2694000,2694015,"]
[26010011,"WE",260190438,"xxxxxxxxx","xxxxxxxxx","2694000,2694015,","nowogard@martessport.com.pl"]
[26010011,"WE",260190421,"xxxxxxxxx","xxxxxxxxx","2694000,2694015,","warszawa.targowek@martessport.com.pl"]
[26010011,"WE",260190437,"xxxxxxxxx","xxxxxxxxx","2694000,2694015,","namyslow@martessport.com.pl"]
[26010011,"WE",260190577,"xxxxxxxxx","xxxxxxxxx","2694000,2694015,","szczytno@martessport.com.pl"]
[26010011,"WE",260190883,"xxxxxxxxx","xxxxxxxxx","2694000,2694015,","chomutov@martessport.com.pl"]
[26010011,"WE",260190431,"xxxxxxxxx","xxxxxxxxx","2694000,2694015,","swiecie@martessport.com.pl"]
[26010011,"WE",260190882,"xxxxxxxxx","xxxxxxxxx","2694000,2694015,"]
[26010011,"WE",260190429,"xxxxxxxxx","xxxxxxxxx","2694000,2694015,","swinoujscie@martessport.com.pl"]
[26010011,"WE",260190610,"xxxxxxxxx","xxxxxxxxx","2694000,2694015,","opole.turawa@martessport.com.pl"]
[26010011,"WE",260190497,"xxxxxxxxx","xxxxxxxxx","2694000,2694015,","stalowawola@martessport.com.pl"]
[26010011,"WE",260190890,"xxxxxxxxx","xxxxxxxxx","2694000,2694015,","leszno2@martessport.com.pl"]
[26010011,"WE",260190250,"xxxxxxxxx","xxxxxxxxx","2694000,2694015,","ostroleka@martessport.com.pl"]
[26010011,"WE",260190211,"xxxxxxxxx","xxxxxxxxx","2694000,2694015,","kalisz.amber@martessport.com.pl"]
[26010011,"WE",260190727,"xxxxxxxxx","xxxxxxxxx","2694000,2694015,","warszawa.zielonytargowek@martessport.com.pl"]
[26010011,"WE",260190715,"xxxxxxxxx","xxxxxxxxx","2694000,2694015,","pisek@martessport.com.pl"]
[26010011,"WE",260190746,"xxxxxxxxx","xxxxxxxxx","2694000,2694015,","bialapodlaska.metropark@martessport.com.pl"]
[26010011,"WE",260190616,"xxxxxxxxx","xxxxxxxxx","2694000,2694015,","boleslawiec@martessport.com.pl"]
[26010011,"WE",260190488,"xxxxxxxxx","xxxxxxxxx","2694000,2694015,","bialystok@martessport.com.pl"]
[26010011,"WE",260190495,"xxxxxxxxx","xxxxxxxxx","2694000,2694015,","hrubieszow@martessport.com.pl"]
[26010011,"WE",260190361,"xxxxxxxxx","xxxxxxxxx","2694000,2694015,","wloclawek.focus@martessport.com.pl"]
[26010011,"WE",260190251,"xxxxxxxxx","xxxxxxxxx","2694000,2694015,","kutno@martessport.com.pl"]
[26010011,"WE",260190433,"xxxxxxxxx","xxxxxxxxx","2694000,2694015,","starachowice@martessport.com.pl"]
[26010011,"WE",260190435,"xxxxxxxxx","xxxxxxxxx","2694000,2694015,","kutno@martessport.com.pl"]
[26010011,"WE",260190430,"xxxxxxxxx","xxxxxxxxx","2694000,2694015,","rzeszow.krasne@martessport.com.pl"]
[26010011,"WE",260190588,"xxxxxxxxx","xxxxxxxxx","2694000,2694015,","tarnobrzeg@martessport.com.pl"]
[26010011,"WE",260190489,"xxxxxxxxx","xxxxxxxxx","2694000,2694015,","lubartow@martessport.com.pl"]
[26010011,"WE",260190252,"xxxxxxxxx","xxxxxxxxx","2694000,2694015,","lubliniec@martessport.com.pl"]
[26010011,"WE",260190413,"xxxxxxxxx","xxxxxxxxx","2694000,2694015,","tomaszowlubelski@martessport.com.pl"]
[26010011,"WE",260190824,"xxxxxxxxx","xxxxxxxxx","2694000,2694015,","dzialdowo@martessport.com.pl"]
[26010011,"WE",260190367,"xxxxxxxxx","xxxxxxxxx","2694000,2694015,","skarzysko@martessport.com.pl"]
[26010011,"WE",260190767,"xxxxxxxxx","xxxxxxxxx","2694000,2694015,","praha_mecholupy@martessport.com.pl"]
[26010011,"WE",260190705,"xxxxxxxxx","xxxxxxxxx","2694000,2694015,","karvina@martessport.com.pl"]
[26010011,"WE",260190425,"xxxxxxxxx","xxxxxxxxx","2694000,2694015,","rzeszow@martessport.com.pl"]
[26010011,"WE",260190723,"xxxxxxxxx","xxxxxxxxx","2694000,2694015,","wroclaw.dominikanska@martessport.com.pl"]
[26010011,"WE",260190773,"xxxxxxxxx","xxxxxxxxx","2694000,2694015,","wroclaw.pasaz@martessport.com.pl"]
[26010011,"WE",260190194,"xxxxxxxxx","xxxxxxxxx","2694000,2694015,","bytom@martessport.com.pl"]
[26010011,"WE",260190257,"xxxxxxxxx","xxxxxxxxx","2694000,2694015,","elk@martessport.com.pl"]
[26010011,"WE",260190346,"xxxxxxxxx","xxxxxxxxx","2694000,2694015,","kolobrzeg@martessport.com.pl"]
[26010011,"WE",260190663,"xxxxxxxxx","xxxxxxxxx","2694000,2694015,","luban@martessport.com.pl"]
[26010011,"WE",260190894,"xxxxxxxxx","xxxxxxxxx","2694000,2694015,","zabrze.platan@martessport.com.pl"]
[26010011,"WE",260190294,"xxxxxxxxx","xxxxxxxxx","2694000,2694015,","bialogard@martessport.com.pl"]
[26010011,"WE",260190149,"xxxxxxxxx","xxxxxxxxx","2694000,2694015,","zabrze@martessport.com.pl"]
[26010011,"WE",260190407,"xxxxxxxxx","xxxxxxxxx","2694000,2694015,","jeleniagora2@martessport.com.pl"]
[26010011,"WE",260190366,"xxxxxxxxx","xxxxxxxxx","2694000,2694015,","starogardgdanski@martessport.com.pl"]
[26010011,"WE",260190414,"xxxxxxxxx","xxxxxxxxx","2694000,2694015,","krakow.futura@martessport.com.pl"]
[26010011,"WE",260190428,"xxxxxxxxx","xxxxxxxxx","2694000,2694015,","rzeszow.plaza@martessport.com.pl"]
[26010011,"WE",260190496,"xxxxxxxxx","xxxxxxxxx","2694000,2694015,","rumia2@martessport.com.pl"]
[26010011,"WE",260190207,"xxxxxxxxx","xxxxxxxxx","2694000,2694015,","olesnica@martessport.com.pl"]
[26010011,"WE",260190985,"xxxxxxxxx","xxxxxxxxx","2694000,2694015,","ro02_ramnicuvalcea@martessport.com.pl"]
[26010011,"WE",260190791,"xxxxxxxxx","xxxxxxxxx","2694000,2694015,","tychy@martessport.com.pl"]
[26010011,"WE",260190189,"xxxxxxxxx","xxxxxxxxx","2694000,2694015,","grojec@martessport.com.pl"]
[26010011,"WE",260190301,"xxxxxxxxx","xxxxxxxxx","2694000,2694015,","szczecinek@martessport.com.pl"]
[26010011,"WE",260190695,"xxxxxxxxx","xxxxxxxxx","2694000,2694015,","radom.sloneczna@martessport.com.pl"]
[26010011,"WE",260190351,"xxxxxxxxx","xxxxxxxxx","2694000,2694015,","sanok@martessport.com.pl"]
[26010011,"WE",260191005,"xxxxxxxxx","xxxxxxxxx","2694000,2694015,","parczew@martessport.com.pl"]
[26010011,"WE",260190191,"xxxxxxxxx","xxxxxxxxx","2694000,2694015,","siedlce@martessport.com.pl"]
[26010011,"WE",260190585,"xxxxxxxxx","xxxxxxxxx","2694000,2694015,","gdansk.alfa@martessport.com.pl"]
[26010011,"WE",260191015,"xxxxxxxxx","xxxxxxxxx","2694000,2694015,","braniewo@martessport.com.pl"]
[26010011,"WE",260190204,"xxxxxxxxx","xxxxxxxxx","2694000,2694015,","olawa@martessport.com.pl"]
[26010011,"WE",260190169,"xxxxxxxxx","xxxxxxxxx","2694000,2694015,","nowysacz@martessport.com.pl"]
[26010011,"WE",260190154,"xxxxxxxxx","xxxxxxxxx","2694000,2694015,","klodzko@martessport.com.pl"]
[26010011,"WE",260190354,"xxxxxxxxx","xxxxxxxxx","2694000,2694015,","konin2@martessport.com.pl"]
[26010011,"WE",260190586,"xxxxxxxxx","xxxxxxxxx","2694000,2694015,","glogow.glogovia@martessport.com.pl"]
[26010011,"WE",260190618,"xxxxxxxxx","xxxxxxxxx","2694000,2694015,","poznan.posnania@martessport.com.pl"]
[26010011,"WE",260190144,"xxxxxxxxx","xxxxxxxxx","2694000,2694015,","rzeszow.plaza@martessport.com.pl"]
[26010011,"WE",260190855,"xxxxxxxxx","xxxxxxxxx","2694000,2694015,","sosnowiec.plaza@martessport.com.pl"]
[26010011,"WE",260190500,"xxxxxxxxx","xxxxxxxxx","2694000,2694015,","wyszkow@martessport.com.pl"]
[26010011,"WE",260191026,"xxxxxxxxx","xxxxxxxxx","2694000,2694015,"]
[26010011,"WE",260190353,"xxxxxxxxx","xxxxxxxxx","2694000,2694015,","wielun@martessport.com.pl"]
[26010011,"WE",260191000,"xxxxxxxxx","xxxxxxxxx","2694000,2694015,","poznan.malta@martessport.com.pl"]
[26010011,"WE",260190300,"xxxxxxxxx","xxxxxxxxx","2694000,2694015,","gryfice@martessport.com.pl"]
[26010011,"WE",260190806,"xxxxxxxxx","xxxxxxxxx","2694000,2694015,","zywiec@martessport.com.pl"]
[26010011,"WE",260190766,"xxxxxxxxx","xxxxxxxxx","2694000,2694015,","sumperk@martessport.com.pl"]
[26010011,"WE",260190230,"xxxxxxxxx","xxxxxxxxx","2694000,2694015,","turek@martessport.com.pl"]
[26010011,"WE",260190498,"xxxxxxxxx","xxxxxxxxx","2694000,2694015,","bydgoszcz.arkady@martessport.com.pl"]
[26010011,"WE",260190434,"xxxxxxxxx","xxxxxxxxx","2694000,2694015,","gryfice@martessport.com.pl"]
[26010011,"WE",260190499,"xxxxxxxxx","xxxxxxxxx","2694000,2694015,","goldap@martessport.com.pl"]
[26010011,"WE",260190757,"xxxxxxxxx","xxxxxxxxx","2694000,2694015,","skierniewice@martessport.com.pl"]
[26010011,"WE",260190188,"xxxxxxxxx","xxxxxxxxx","2694000,2694015,","sochaczew@martessport.com.pl"]
[26010011,"WE",260190427,"xxxxxxxxx","xxxxxxxxx","2694000,2694015,","torun@martessport.com.pl"]
[26010011,"WE",260190199,"xxxxxxxxx","xxxxxxxxx","2694000,2694015,","ciechanow@martessport.com.pl"]
[26010011,"WE",260190845,"xxxxxxxxx","xxxxxxxxx","2694000,2694015,","cz_sklepy@martessport.com.pl"]
[26010011,"WE",260191021,"xxxxxxxxx","xxxxxxxxx","2694000,2694015,","zgierz@martessport.com.pl"]
[26010011,"WE",260190183,"xxxxxxxxx","xxxxxxxxx","2694000,2694015,","kedzierzynkozle@martessport.com.pl"]
[26010011,"WE",260190185,"xxxxxxxxx","xxxxxxxxx","2694000,2694015,","warszawa@martessport.com.pl"]
[26010011,"WE",260190700,"xxxxxxxxx","xxxxxxxxx","2694000,2694015,","olsztyn.aura@martessport.com.pl"]
[26010011,"WE",260190164,"xxxxxxxxx","xxxxxxxxx","2694000,2694015,","krakow@martessport.com.pl"]
[26010011,"WE",260190350,"xxxxxxxxx","xxxxxxxxx","2694000,2694015,","vivo.lublin@fitanu.com"]
[26010011,"WE",260190150,"xxxxxxxxx","xxxxxxxxx","2694000,2694015,","szczecin@martessport.com.pl"]
[26010011,"WE",260191011,"xxxxxxxxx","xxxxxxxxx","2694000,2694015,","leba@martessport.com.pl"]
[26010011,"WE",260190734,"xxxxxxxxx","xxxxxxxxx","2694000,2694015,","krakow.serenada@martessport.com.pl"]
[26010011,"WE",260190970,"xxxxxxxxx","xxxxxxxxx","2694000,2694015,","jaroslaw.staraujezdzalnia@martessport.com.pl"]
[26010011,"WE",260191054,"xxxxxxxxx","xxxxxxxxx","2694000,2694015,","ro06_calarasi@martessport.com.pl"]
[26010011,"WE",260190836,"xxxxxxxxx","xxxxxxxxx","2694000,2694015,","radzynpodlaski@martessport.com.pl"]
[26010011,"WE",260190349,"xxxxxxxxx","xxxxxxxxx","2694000,2694015,","zyrardow@martessport.com.pl"]
[26010011,"WE",260190153,"xxxxxxxxx","xxxxxxxxx","2694000,2694015,","walbrzych@martessport.com.pl"]
[26010011,"WE",260190891,"xxxxxxxxx","xxxxxxxxx","2694000,2694015,","biskupiec@martessport.com.pl"]
[26010011,"WE",260190355,"xxxxxxxxx","xxxxxxxxx","2694000,2694015,","knurow@martessport.com.pl"]
[26010011,"WE",260190293,"xxxxxxxxx","xxxxxxxxx","2694000,2694015,","pila@martessport.com.pl"]
[26010011,"WE",260190955,"xxxxxxxxx","xxxxxxxxx","2694000,2694015,","lipno@martessport.com.pl"]
[26010011,"WE",260191268,"xxxxxxxxx","xxxxxxxxx","2694000,2694015,","ustrzyki@martessport.com.pl"]
[26010011,"WE",260190157,"xxxxxxxxx","xxxxxxxxx","2694000,2694015,","kalisz@martessport.com.pl"]
[26010011,"WE",260190650,"xxxxxxxxx","xxxxxxxxx","2694000,2694015,","katowice@martessport.com.pl"]
[26010011,"WE",260190733,"xxxxxxxxx","xxxxxxxxx","2694000,2694015,","ostrowiec@martessport.com.pl"]
[26010011,"WE",260190724,"xxxxxxxxx","xxxxxxxxx","2694000,2694015,","lublin.outletmartes@martessport.com.pl"]
[26010011,"WE",260190656,"xxxxxxxxx","xxxxxxxxx","2694000,2694015,","pruszczgdanski@martessport.com.pl"]
[26010011,"WE",260190665,"xxxxxxxxx","xxxxxxxxx","2694000,2694015,","sandomierz@martessport.com.pl"]
[26010011,"WE",260190198,"xxxxxxxxx","xxxxxxxxx","2694000,2694015,","belchatow@martessport.com.pl"]
[26010011,"WE",260190775,"xxxxxxxxx","xxxxxxxxx","2694000,2694015,","rawicz@martessport.com.pl"]
[26010011,"WE",260190186,"xxxxxxxxx","xxxxxxxxx","2694000,2694015,","zgorzelec.plaza@martessport.com.pl"]
[26010011,"WE",260190316,"xxxxxxxxx","xxxxxxxxx","2694000,2694015,","hajnowka@martessport.com.pl"]
[26010011,"WE",260191002,"xxxxxxxxx","xxxxxxxxx","2694000,2694015,","wysokiemazowieckie@martessport.com.pl"]
[26010011,"WE",260190731,"xxxxxxxxx","xxxxxxxxx","2694000,2694015,","krosno.vivo@martessport.com.pl"]
[26010011,"WE",260190313,"xxxxxxxxx","xxxxxxxxx","2694000,2694015,","namyslow@martessport.com.pl"]
[26010011,"WE",260190148,"xxxxxxxxx","xxxxxxxxx","2694000,2694015,","przemysl@martessport.com.pl"]
[26010011,"WE",260190311,"xxxxxxxxx","xxxxxxxxx","2694000,2694015,","bialapodlaska@martessport.com.pl"]
[26010011,"WE",260190811,"xxxxxxxxx","xxxxxxxxx","2694000,2694015,","miedzyrzecpodlaski@martessport.com.pl"]
[26010011,"WE",260190182,"xxxxxxxxx","xxxxxxxxx","2694000,2694015,","lodz@martessport.com.pl"]
[26010011,"WE",260190261,"xxxxxxxxx","xxxxxxxxx","2694000,2694015,","ketrzyn@martessport.com.pl"]
[26010011,"WE",260190197,"xxxxxxxxx","xxxxxxxxx","2694000,2694015,","kluczbork@martessport.com.pl"]
[26010011,"WE",260190135,"xxxxxxxxx","xxxxxxxxx","2694000,2694015,","czeladz@martessport.com.pl"]
[26010011,"WE",260190805,"xxxxxxxxx","xxxxxxxxx","2694000,2694015,","wadowice@martessport.com.pl"]
[26010011,"WE",260190161,"xxxxxxxxx","xxxxxxxxx","2694000,2694015,","grudziadz@martessport.com.pl"]
[26010011,"WE",260190771,"xxxxxxxxx","xxxxxxxxx","2694000,2694015,","katowice.silesia@martessport.com.pl"]
[26010011,"WE",260190325,"xxxxxxxxx","xxxxxxxxx","2694000,2694015,","rybnikfocus@martessport.com.pl"]
[26010011,"WE",260190195,"xxxxxxxxx","xxxxxxxxx","2694000,2694015,","swiecie@martessport.com.pl"]
[26010011,"WE",260190505,"xxxxxxxxx","xxxxxxxxx","2694000,2694015,","wroclaw.ikea@martessport.com.pl"]
[26010011,"WE",260190739,"xxxxxxxxx","xxxxxxxxx","2694000,2694015,","dzierzoniow@martessport.com.pl"]
[26010011,"WE",260190184,"xxxxxxxxx","xxxxxxxxx","2694000,2694015,","poznan@martessport.com.pl"]
[26010011,"WE",260190147,"xxxxxxxxx","xxxxxxxxx","2694000,2694015,","suwalki@martessport.com.pl"]
[26010011,"WE",260190840,"xxxxxxxxx","xxxxxxxxx","2694000,2694015,","brzeszcze@martessport.com.pl"]
[26010011,"WE",260190814,"xxxxxxxxx","xxxxxxxxx","2694000,2694015,","monki@martessport.com.pl"]
[26010011,"WE",260190769,"xxxxxxxxx","xxxxxxxxx","2694000,2694015,","grajewo@martessport.com.pl"]
[26010011,"WE",260190770,"xxxxxxxxx","xxxxxxxxx","2694000,2694015,","ostroleka.cityspot@martessport.com.pl"]
[26010011,"WE",260190810,"xxxxxxxxx","xxxxxxxxx","2694000,2694015,","zielonagora@martessport.com.pl"]
[26010011,"WE",260190965,"xxxxxxxxx","xxxxxxxxx","2694000,2694015,","skoczow@martessport.com.pl"]
[26010011,"WE",260190591,"xxxxxxxxx","xxxxxxxxx","2694000,2694015,","szamotuly@martessport.com.pl"]
[26010011,"WE",260190171,"xxxxxxxxx","xxxxxxxxx","2694000,2694015,","bydgoszcz@martessport.com.pl"]
[26010011,"WE",260190589,"xxxxxxxxx","xxxxxxxxx","2694000,2694015,","wroclaw.auchan@martessport.com.pl"]
[26010011,"WE",260190693,"xxxxxxxxx","xxxxxxxxx","2694000,2694015,","kartuzy@martessport.com.pl"]
[26010011,"WE",260190139,"xxxxxxxxx","xxxxxxxxx","2694000,2694015,","lubin@martessport.com.pl"]
[26010011,"WE",260190625,"xxxxxxxxx","xxxxxxxxx","2694000,2694015,","wolomin@martessport.com.pl"]
[26010011,"WE",260190666,"xxxxxxxxx","xxxxxxxxx","2694000,2694015,","cieszyn@martessport.com.pl"]
[26010011,"WE",260190964,"xxxxxxxxx","xxxxxxxxx","2694000,2694015,","pabianice@martessport.com.pl"]
[26010011,"WE",260190870,"xxxxxxxxx","xxxxxxxxx","2694000,2694015,","chodziez@martessport.com.pl"]
[26010011,"WE",260190156,"xxxxxxxxx","xxxxxxxxx","2694000,2694015,","sieradz@martessport.com.pl"]
[26010011,"WE",260190526,"xxxxxxxxx","xxxxxxxxx","2694000,2694015,","jaworzno@martessport.com.pl"]
[26010011,"WE",260190856,"xxxxxxxxx","xxxxxxxxx","2694000,2694015,","warszawa.wolapark@martessport.com.pl"]
[26010011,"WE",260190536,"xxxxxxxxx","xxxxxxxxx","2694000,2694015,","poznan.a2@martessport.com.pl"]
[26010011,"WE",260191003,"xxxxxxxxx","xxxxxxxxx","2694000,2694015,","mogilno@martessport.com.pl"]
[26010011,"WE",260190315,"xxxxxxxxx","xxxxxxxxx","2694000,2694015,","krosno@martessport.com.pl"]
[26010011,"WE",260190655,"xxxxxxxxx","xxxxxxxxx","2694000,2694015,","grodziskmazowiecki@martessport.com.pl"]
[26010011,"WE",260190675,"xxxxxxxxx","xxxxxxxxx","2694000,2694015,","bialystok.auchan@martessport.com.pl"]
[26010011,"WE",260190678,"xxxxxxxxx","xxxxxxxxx","2694000,2694015,","gizycko2@martessport.com.pl"]
[26010011,"WE",260190203,"xxxxxxxxx","xxxxxxxxx","2694000,2694015,","dabrowagornicza@martessport.com.pl"]
[26010011,"WE",260190722,"xxxxxxxxx","xxxxxxxxx","2694000,2694015,","srem@martessport.com.pl"]
[26010011,"WE",260190839,"xxxxxxxxx","xxxxxxxxx","2694000,2694015,","elblag@martessport.com.pl"]
[26010011,"WE",260190576,"xxxxxxxxx","xxxxxxxxx","2694000,2694015,","bytom.plejada@martessport.com.pl"]
[26010011,"WE",260190696,"xxxxxxxxx","xxxxxxxxx","2694000,2694015,","koszalin@martessport.com.pl"]
[26010011,"WE",260190347,"xxxxxxxxx","xxxxxxxxx","2694000,2694015,","jaslo@martessport.com.pl"]
[26010011,"WE",260190745,"xxxxxxxxx","xxxxxxxxx","2694000,2694015,","wisla@martessport.com.pl"]
[26010011,"WE",260190176,"xxxxxxxxx","xxxxxxxxx","2694000,2694015,","zgorzelec@martessport.com.pl"]
[26010011,"WE",260190141,"xxxxxxxxx","xxxxxxxxx","2694000,2694015,","ostrow@martessport.com.pl"]
[26010011,"WE",260190151,"xxxxxxxxx","xxxxxxxxx","2694000,2694015,","krakow.bonarka@martessport.com.pl"]
[26010011,"WE",260190809,"xxxxxxxxx","xxxxxxxxx","2694000,2694015,","krakow.tesco@martessport.com.pl"]
[26010011,"WE",260190273,"xxxxxxxxx","xxxxxxxxx","2694000,2694015,","starachowice.galardia@martessport.com.pl"]
[26010011,"WE",260190422,"xxxxxxxxx","xxxxxxxxx","2694000,2694015,","piekaryslaskie@martessport.com.pl"]
[26010011,"WE",260190838,"xxxxxxxxx","xxxxxxxxx","2694000,2694015,","dabrowagornicza.vendo@martessport.com.pl"]
[26010011,"WE",260190654,"xxxxxxxxx","xxxxxxxxx","2694000,2694015,","myslowice@martessport.com.pl"]
[26010011,"WE",260190174,"xxxxxxxxx","xxxxxxxxx","2694000,2694015,","gdynia@martessport.com.pl"]
[26010011,"WE",260190587,"xxxxxxxxx","xxxxxxxxx","2694000,2694015,","warszawa.ferio@martessport.com.pl"]
[26010011,"WE",260190322,"xxxxxxxxx","xxxxxxxxx","2694000,2694015,","nowytarg@martessport.com.pl"]
[26010011,"WE",260190145,"xxxxxxxxx","xxxxxxxxx","2694000,2694015,","wloclawek@martessport.com.pl"]
[26010011,"WE",260190136,"xxxxxxxxx","xxxxxxxxx","2694000,2694015,","czestochowa@martessport.com.pl"]
[26010011,"WE",260190530,"xxxxxxxxx","xxxxxxxxx","2694000,2694015,","nowytomysl@martessport.com.pl"]
[26010011,"WE",260190994,"xxxxxxxxx","xxxxxxxxx","2694000,2694015,","grudziadz.pasazwislany@martessport.com.pl"]
[26010011,"WE",260190523,"xxxxxxxxx","xxxxxxxxx","2694000,2694015,","kwidzyn@martessport.com.pl"]
[26010011,"WE",260190636,"xxxxxxxxx","xxxxxxxxx","2694000,2694015,","minskmazowiecki2@martessport.com.pl"]
[26010011,"WE",260190602,"xxxxxxxxx","xxxxxxxxx","2694000,2694015,","leszno@martessport.com.pl"]
[26010011,"WE",260190908,"xxxxxxxxx","xxxxxxxxx","2694000,2694015,","polkowice@martessport.com.pl"]
[26010011,"WE",260190977,"xxxxxxxxx","xxxxxxxxx","2694000,2694015,","slupca@martessport.com.pl"]
[26010011,"WE",260190895,"xxxxxxxxx","xxxxxxxxx","2694000,2694015,","cieszyn.stela@martessport.com.pl"]
[26010011,"WE",260190812,"xxxxxxxxx","xxxxxxxxx","2694000,2694015,","wlodawa@martessport.com.pl"]
[26010011,"WE",260190676,"xxxxxxxxx","xxxxxxxxx","2694000,2694015,","kolobrzeg.albatros@martessport.com.pl"]
[26010011,"WE",260190592,"xxxxxxxxx","xxxxxxxxx","2694000,2694015,","szczecinek2@martessport.com.pl"]
[26010011,"WE",260190201,"xxxxxxxxx","xxxxxxxxx","2694000,2694015,","starachowice@martessport.com.pl"]
[26010011,"WE",260190892,"xxxxxxxxx","xxxxxxxxx","2694000,2694015,","katowice.libero@martessport.com.pl"]
[26010011,"WE",260190632,"xxxxxxxxx","xxxxxxxxx","2694000,2694015,","stargard@martessport.com.pl"]
[26010011,"WE",260190871,"xxxxxxxxx","xxxxxxxxx","2694000,2694015,","czarnkow@martessport.com.pl"]
[26010011,"WE",260190529,"xxxxxxxxx","xxxxxxxxx","2694000,2694015,","tarnow.tarnovia@martessport.com.pl"]
[26010011,"WE",260190976,"xxxxxxxxx","xxxxxxxxx","2694000,2694015,","kalwariazebrzydowska@martessport.com.pl"]
[26010011,"WE",260190917,"xxxxxxxxx","xxxxxxxxx","2694000,2694015,","skarzysko.hermes@martessport.com.pl"]
[26010011,"WE",260190807,"xxxxxxxxx","xxxxxxxxx","2694000,2694015,","bydgoszcz.rondo@martessport.com.pl"]
[26010011,"WE",260191017,"xxxxxxxxx","xxxxxxxxx","2694000,2694015,","szczecin.rondohakena@martessport.com.pl"]
[26010011,"WE",260190501,"xxxxxxxxx","xxxxxxxxx","2694000,2694015,","ilawa@martessport.com.p"]
[26010011,"WE",260190177,"xxxxxxxxx","xxxxxxxxx","2694000,2694015,","ilawa@martessport.com.pl"]
[26010011,"WE",260190652,"xxxxxxxxx","xxxxxxxxx","2694000,2694015,","oswiecim2@martessport.com.pl"]
[26010011,"WE",260190179,"xxxxxxxxx","xxxxxxxxx","2694000,2694015,","debica@martessport.com.pl"]
[26010011,"WE",260190664,"xxxxxxxxx","xxxxxxxxx","2694000,2694015,","zagan@martessport.com.pl"]
[26010011,"WE",260191016,"xxxxxxxxx","xxxxxxxxx","2694000,2694015,","otwock@martessport.com.pl"]
[26010011,"WE",260190684,"xxxxxxxxx","xxxxxxxxx","2694000,2694015,","zambrow@martessport.com.pl"]
[26010011,"WE",260190677,"xxxxxxxxx","xxxxxxxxx","2694000,2694015,","wroclaw.magnolia@martessport.com.pl"]
[26010011,"WE",260190152,"xxxxxxxxx","xxxxxxxxx","2694000,2694015,","geminibielsko@martessport.com.pl"]
[26010011,"WE",260190967,"xxxxxxxxx","xxxxxxxxx","2694000,2694015,","krapkowice@martessport.com.pl"]
[26010011,"WE",260190260,"xxxxxxxxx","xxxxxxxxx","2694000,2694015,","gliwice@martessport.com.pl"]
[26010011,"WE",260191004,"xxxxxxxxx","xxxxxxxxx","2694000,2694015,","konskie@martessport.com.pl"]
[26010011,"WE",260190702,"xxxxxxxxx","xxxxxxxxx","2694000,2694015,","poznan.starybrowar@martessport.com.pl"]
[26010011,"WE",260191195,"xxxxxxxxx","xxxxxxxxx","2694000,2694015,"]
[26010011,"WE",260190962,"xxxxxxxxx","xxxxxxxxx","2694000,2694015,","przemysl.bluepark@martessport.com.pl"]
[26010011,"WE",260190531,"xxxxxxxxx","xxxxxxxxx","2694000,2694015,","tarnow.citymarket@martessport.com.pl"]
[26010011,"WE",260190952,"xxxxxxxxx","xxxxxxxxx","2694000,2694015,","poznan.malta@martessport.com.pl"]
[26010011,"WE",260190645,"xxxxxxxxx","xxxxxxxxx","2694000,2694015,","legionowo@martessport.com.pl"]
[26010011,"WE",260190170,"xxxxxxxxx","xxxxxxxxx","2694000,2694015,","nysa@martessport.com.pl"]
[26010011,"WE",260190641,"xxxxxxxxx","xxxxxxxxx","2694000,2694015,","warszawa.junior@martessport.com.pl"]
[26010011,"WE",260190324,"xxxxxxxxx","xxxxxxxxx","2694000,2694015,","koscierzyna@martessport.com.pl"]
[26010011,"WE",260190718,"xxxxxxxxx","xxxxxxxxx","2694000,2694015,","skawina@martessport.com.pl"]
[26010011,"WE",260190539,"xxxxxxxxx","xxxxxxxxx","2694000,2694015,","szczecin.molo@martessport.com.pl"]
[26010011,"WE",260190717,"xxxxxxxxx","xxxxxxxxx","2694000,2694015,","puck@martessport.com.pl"]
[26010011,"WE",260190321,"xxxxxxxxx","xxxxxxxxx","2694000,2694015,","bielsko.sfera@martessport.com.pl"]
[26010011,"WE",260190968,"xxxxxxxxx","xxxxxxxxx","2694000,2694015,","janki@martessport.com.pl"]
[26010011,"WE",260190193,"xxxxxxxxx","xxxxxxxxx","2694000,2694015,","legnica@martessport.com.pl"]
[26010011,"WE",260190973,"xxxxxxxxx","xxxxxxxxx","2694000,2694015,","legnica@martessport.com.pl"]
[26010011,"WE",260190949,"xxxxxxxxx","xxxxxxxxx","2694000,2694015,","aleksandrowkujawski@martessport.com.pl"]
[26010011,"WE",260190905,"xxxxxxxxx","xxxxxxxxx","2694000,2694015,","piaseczno@martessport.com.pl"]
[26010011,"WE",260190140,"xxxxxxxxx","xxxxxxxxx","2694000,2694015,","tarnow@martessport.com.pl"]
[26010011,"WE",260190234,"xxxxxxxxx","xxxxxxxxx","2694000,2694015,","milanowek@martessport.com.pl"]
[26010011,"WE",260190747,"xxxxxxxxx","xxxxxxxxx","2694000,2694015,","olawa.quickpark@martessport.com.pl"]
[26010011,"WE",260190969,"xxxxxxxxx","xxxxxxxxx","2694000,2694015,","pultusk@martessport.com.pl"]
[26010011,"WE",260190172,"xxxxxxxxx","xxxxxxxxx","2694000,2694015,","konin@martessport.com.pl"]
[26010011,"WE",260190959,"xxxxxxxxx","xxxxxxxxx","2694000,2694015,","gorlice@martessport.com.pl"]
[26010011,"WE",260190265,"xxxxxxxxx","xxxxxxxxx","2694000,2694015,","bartoszyce@martessport.com.pl"]
[26010011,"WE",260190606,"xxxxxxxxx","xxxxxxxxx","2694000,2694015,","lodz.port@martessport.com.pl"]
[26010011,"WE",260190593,"xxxxxxxxx","xxxxxxxxx","2694000,2694015,","bochnia@martessport.com.pl"]
[26010011,"WE",260190158,"xxxxxxxxx","xxxxxxxxx","2694000,2694015,","gniezno@martessport.com.pl"]
[26010011,"WE",260190808,"xxxxxxxxx","xxxxxxxxx","2694000,2694015,","opoczno@martessport.com.pl"]
[26010011,"WE",260190991,"xxxxxxxxx","xxxxxxxxx","2694000,2694015,","marki@martessport.com.pl"]
[26010011,"WE",260190732,"xxxxxxxxx","xxxxxxxxx","2694000,2694015,","lodz.galerialodzka@martessport.com.pl"]
[26010011,"WE",260190205,"xxxxxxxxx","xxxxxxxxx","2694000,2694015,","mlawa@martessport.com.pl"]
[26010011,"WE",260190143,"xxxxxxxxx","xxxxxxxxx","2694000,2694015,","rzeszow@martessport.com.pl"]
[26010011,"WE",260190331,"xxxxxxxxx","xxxxxxxxx","2694000,2694015,","jastrzebiezdroj@martessport.com.pl"]
[26010011,"WE",260190187,"xxxxxxxxx","xxxxxxxxx","2694000,2694015,","chojnice@martessport.com.pl"]
[26010011,"WE",260191001,"xxxxxxxxx","xxxxxxxxx","2694000,2694015,","chelmno@martessport.com.pl"]
[26010011,"WE",260190163,"xxxxxxxxx","xxxxxxxxx","2694000,2694015,","tczew@martessport.com.pl"]
[26010011,"WE",260190166,"xxxxxxxxx","xxxxxxxxx","2694000,2694015,","glogow@martessport.com.pl"]
[26010011,"WE",260190963,"xxxxxxxxx","xxxxxxxxx","2694000,2694015,","elblag.portowa@martessport.com.pl"]
[26010011,"WE",260190835,"xxxxxxxxx","xxxxxxxxx","2694000,2694015,","srodawielkopolska@martessport.com.pl"]
[26010011,"WE",260190667,"xxxxxxxxx","xxxxxxxxx","2694000,2694015,","mielec@martessport.com.pl"]
[26010011,"WE",260190624,"xxxxxxxxx","xxxxxxxxx","2694000,2694015,","jarocin@martessport.com.pl"]
[26010011,"WE",260190159,"xxxxxxxxx","xxxxxxxxx","2694000,2694015,","oswiecim@martessport.com.pl"]
[26010011,"WE",260190884,"xxxxxxxxx","xxxxxxxxx","2694000,2694015,","koscian@martessport.com.pl"]
[26010011,"WE",260190735,"xxxxxxxxx","xxxxxxxxx","2694000,2694015,","swarzedz@martessport.com.pl"]
[26010011,"WE",260190701,"xxxxxxxxx","xxxxxxxxx","2694000,2694015,","sulechow@martessport.com.pl"]
[26010011,"WE",260190155,"xxxxxxxxx","xxxxxxxxx","2694000,2694015,","zamosc@martessport.com.pl"]
[26010011,"WE",260190312,"xxxxxxxxx","xxxxxxxxx","2694000,2694015,","zary@martessport.com.pl"]
[26010011,"WE",260190774,"xxxxxxxxx","xxxxxxxxx","2694000,2694015,","gostyn@martessport.com.pl"]
[26010011,"WE",260190540,"xxxxxxxxx","xxxxxxxxx","2694000,2694015,","gliwice.europacentralna@martessport.com.pl"]
[26010011,"WE",260190720,"xxxxxxxxx","xxxxxxxxx","2694000,2694015,","poznan.starybrowar@martessport.com.pl"]
[26010011,"WE",260190345,"xxxxxxxxx","xxxxxxxxx","2694000,2694015,","gdynia.szperk@martessport.com.pl"]
[26010011,"WE",260190138,"xxxxxxxxx","xxxxxxxxx","2694000,2694015,","rybnik@martessport.com.pl"]
[26010011,"WE",260190960,"xxxxxxxxx","xxxxxxxxx","2694000,2694015,","miechow@martessport.com.pl"]
[26010011,"WE",260190956,"xxxxxxxxx","xxxxxxxxx","2694000,2694015,","gliwice.outlet@martessport.com.pl"]
[26010011,"WE",260190601,"xxxxxxxxx","xxxxxxxxx","2694000,2694015,","debica.raj@martessport.com.pl"]
[26010011,"WE",260190514,"xxxxxxxxx","xxxxxxxxx","2694000,2694015,","zamosc.hopstop@martessport.com.pl"]
[26010011,"WE",260190137,"xxxxxxxxx","xxxxxxxxx","2694000,2694015,","sarni.stok@martessport.com.pl"]
[26010011,"WE",260190694,"xxxxxxxxx","xxxxxxxxx","2694000,2694015,","legnica.stopshop@martessport.com.pl"]
[26010011,"WE",260190897,"xxxxxxxxx","xxxxxxxxx","2694000,2694015,","pruszkow@martessport.com.pl"]
[26010011,"WE",260190192,"xxxxxxxxx","xxxxxxxxx","2694000,2694015,","radomsko@martessport.com.pl"]
[26010011,"WE",260190980,"xxxxxxxxx","xxxxxxxxx","2694000,2694015,","glogow.multibox@martessport.com.pl"]
[26010011,"WE",260190966,"xxxxxxxxx","xxxxxxxxx","2694000,2694015,","glowno@martessport.com.pl"]
[26010011,"WE",260191184,"xxxxxxxxx","xxxxxxxxx","2694000,2694015,","zlotoryja@martessport.com.pl"]
[26010011,"WE",260190173,"xxxxxxxxx","xxxxxxxxx","2694000,2694015,","poznan.city@martessport.com.pl"]
[26010011,"WE",260190262,"xxxxxxxxx","xxxxxxxxx","2694000,2694015,","nowasol@martessport.com.pl"]
[26010011,"WE",260190202,"xxxxxxxxx","xxxxxxxxx","2694000,2694015,","sosnowiec@martessport.com.pl"]
[26010011,"WE",260190542,"xxxxxxxxx","xxxxxxxxx","2694000,2694015,","szczecin.outletmartes@martessport.com.pl"]
[26010011,"WE",260190736,"xxxxxxxxx","xxxxxxxxx","2694000,2694015,","wroclaw.wroclavia@martessport.com.pl"]
[26010011,"WE",260190162,"xxxxxxxxx","xxxxxxxxx","2694000,2694015,","slupsk@martessport.com.pl"]
[26010011,"WE",260190631,"xxxxxxxxx","xxxxxxxxx","2694000,2694015,","gdansk.auchan@martessport.com.pl"]
[26010011,"WE",260191020,"xxxxxxxxx","xxxxxxxxx","2694000,2694015,","chrzanow@martessport.com.pl"]
[26010011,"WE",260190730,"xxxxxxxxx","xxxxxxxxx","2694000,2694015,","poznan.franowo@martessport.com.pl"]
[26010011,"WE",260190979,"xxxxxxxxx","xxxxxxxxx","2694000,2694015,","brzegdolny@martessport.com.pl"]
[26010011,"WE",260190146,"xxxxxxxxx","xxxxxxxxx","2694000,2694015,","piotrkow@martessport.com.pl"]
[26010011,"WE",260190813,"xxxxxxxxx","xxxxxxxxx","2694000,2694015,","zory2@martessport.com.pl"]
[26010011,"WE",260190190,"xxxxxxxxx","xxxxxxxxx","2694000,2694015,","wodzislaw@martessport.com.pl"]
[26010011,"WE",260191019,"xxxxxxxxx","xxxxxxxxx","2694000,2694015,","tomaszowlubelski.rynek@martessport.com.pl"]
[26010011,"WE",260190371,"xxxxxxxxx","xxxxxxxxx","2694000,2694015,","slupsk2@martessport.com.pl"]
[26010011,"WE",260190266,"xxxxxxxxx","xxxxxxxxx","2694000,2694015,","olsztyn@martessport.com.pl"]
[26010011,"WE",260190165,"xxxxxxxxx","xxxxxxxxx","2694000,2694015,","plock@martessport.com.pl"]
[26010011,"WE",260191027,"xxxxxxxxx","xxxxxxxxx","2694000,2694015,"]
[26010011,"WE",260190896,"xxxxxxxxx","xxxxxxxxx","2694000,2694015,","gubin@martessport.com.pl"]
[26010011,"WE",260190196,"xxxxxxxxx","xxxxxxxxx","2694000,2694015,","gizycko@martessport.com.pl"]
[26010011,"WE",260190635,"xxxxxxxxx","xxxxxxxxx","2694000,2694015,","tomaszowmazowiecki@martessport.com.pl"]
[26010011,"WE",260190910,"xxxxxxxxx","xxxxxxxxx","2694000,2694015,","babicenowe@martessport.com.pl"]
[26010011,"WE",260190233,"xxxxxxxxx","xxxxxxxxx","2694000,2694015,","kielce.korona@martessport.com.pl"]
[26010011,"WE",260190644,"xxxxxxxxx","xxxxxxxxx","2694000,2694015,","nowydwormazowiecki@martessport.com.pl"]
[26010011,"WE",260190768,"xxxxxxxxx","xxxxxxxxx","2694000,2694015,","pisz@martessport.com.pl"]
[26010011,"WE",260190348,"xxxxxxxxx","xxxxxxxxx","2694000,2694015,","plonsk@martessport.com.pl"]
[26010011,"WE",260190772,"xxxxxxxxx","xxxxxxxxx","2694000,2694015,","kozienice@martessport.com.pl"]
[26010011,"WE",260190180,"xxxxxxxxx","xxxxxxxxx","2694000,2694015,","swidnica@martessport.com.pl"]
[26010011,"WE",260190792,"xxxxxxxxx","xxxxxxxxx","2694000,2694015,","gniezno.piastova@martessport.com.pl"]
[26010011,"WE",260190672,"xxxxxxxxx","xxxxxxxxx","2694000,2694015,","sierad@martessport.com.pl"]
[26010011,"WE",260190948,"xxxxxxxxx","xxxxxxxxx","2694000,2694015,","zlotow@martessport.com.pl"]
[26010011,"WE",260190167,"xxxxxxxxx","xxxxxxxxx","2694000,2694015,","inowroclaw@martessport.com.pl"]
[26010011,"WE",260190538,"xxxxxxxxx","xxxxxxxxx","2694000,2694015,","mragowo@martessport.com.pl"]
[26010011,"WE",260190748,"xxxxxxxxx","xxxxxxxxx","2694000,2694015,","swidwin@martessport.com.pl"]
[26010011,"WE",260190837,"xxxxxxxxx","xxxxxxxxx","2694000,2694015,","kolno@martessport.com.pl"]
[26010011,"WE",260190181,"xxxxxxxxx","xxxxxxxxx","2694000,2694015,","opole@martessport.com.pl"]
[26010011,"WE",260190823,"xxxxxxxxx","xxxxxxxxx","2694000,2694015,","wieruszow@martessport.com.pl"]
[26010011,"WE",260190721,"xxxxxxxxx","xxxxxxxxx","2694000,2694015,","plock.mazovia@martessport.com.pl"]
[26010011,"WE",260190975,"xxxxxxxxx","xxxxxxxxx","2694000,2694015,","plock.wisla@martessport.com.pl"]
[26010011,"WE",260190749,"xxxxxxxxx","xxxxxxxxx","2694000,2694015,","police@martessport.com.pl"]
[26010011,"WE",260190200,"xxxxxxxxx","xxxxxxxxx","2694000,2694015,","swidnik@martessport.com.pl"]
[26010011,"WE",260190971,"xxxxxxxxx","xxxxxxxxx","2694000,2694015,","zlocieniec@martessport.com.pl"]
[26010011,"WE",260190533,"xxxxxxxxx","xxxxxxxxx","2694000,2694015,","nowysacz.sandecja@martessport.com.pl"]
[26010011,"WE",260190893,"xxxxxxxxx","xxxxxxxxx","2694000,2694015,","lowicz@martessport.com.pl"]
[26010011,"WE",260190142,"xxxxxxxxx","xxxxxxxxx","2694000,2694015,","torun@martessport.com.pl"]
[26010011,"WE",260190206,"xxxxxxxxx","xxxxxxxxx","2694000,2694015,","brzeg@martessport.com.pl"]
[26010011,"WE",260190326,"xxxxxxxxx","xxxxxxxxx","2694000,2694015,","bytomszombierki@martessport.com.pl"]
[26010011,"WE",260190267,"xxxxxxxxx","xxxxxxxxx","2694000,2694015,","tarnowskiegory@martessport.com.pl"]
[26010011,"WE",260190178,"xxxxxxxxx","xxxxxxxxx","2694000,2694015,","lomza@martessport.com.pl"]
[26010011,"WE",260190961,"xxxxxxxxx","xxxxxxxxx","2694000,2694015,","warszawa.mlociny@martessport.com.pl"]
[26010011,"WE",260190957,"xxxxxxxxx","xxxxxxxxx","2694000,2694015,","drawskopomorskie@martessport.com.pl"]
[26010011,"WE",260190268,"xxxxxxxxx","xxxxxxxxx","2694000,2694015,","gdansk@martessport.com.pl"]
[26010011,"WE",260190603,"xxxxxxxxx","xxxxxxxxx","2694000,2694015,","zdunskawola@martessport.com.pl"]
[26010011,"WE",260190978,"xxxxxxxxx","xxxxxxxxx","2694000,2694015,","gryfino@martessport.com.pl"]
[26010011,"WE",260190958,"xxxxxxxxx","xxxxxxxxx","2694000,2694015,","sokolka@martessport.com.pl"]
[26010011,"WE",260190725,"xxxxxxxxx","xxxxxxxxx","2694000,2694015,","warszawa.polnocna@martessport.com.pl"]
[26010011,"WE",260190247,"xxxxxxxxx","xxxxxxxxx","2694000,2694015,","kielce.echo@martessport.com.pl"]
[26010011,"WE",260190352,"xxxxxxxxx","xxxxxxxxx","2694000,2694015,","lebork@martessport.com.pl"]
[26010011,"WE",260190590,"xxxxxxxxx","xxxxxxxxx","2694000,2694015,","rzgow.outletmartes@martessport.com.pl"]
[26010011,"WE",260190168,"xxxxxxxxx","xxxxxxxxx","2694000,2694015,","torun.copernicus@martessport.com.pl"]
[26010011,"WE",260190597,"xxxxxxxxx","xxxxxxxxx","2694000,2694015,","lomianki@martessport.com.pl"]
[26010011,"WE",260190256,"xxxxxxxxx","xxxxxxxxx","2694000,2694015,","rumia@martessport.com.pl"]
[26010011,"WE",260190690,"xxxxxxxxx","xxxxxxxxx","2694000,2694015,","ciechanow.dekada@martessport.com.pl"]
[26010011,"WE",260190692,"xxxxxxxxx","xxxxxxxxx","2694000,2694015,","nowemiastolubawskie@martessport.com.pl"]
[26010011,"WE",260190600,"xxxxxxxxx","xxxxxxxxx","2694000,2694015,","wrzesnia@martessport.com.pl"]
[26010011,"WE",260190583,"xxxxxxxxx","xxxxxxxxx","2694000,2694015,","swinoujscie.stopshop@martessport.com.pl"]
[26010011,"WE",260190581,"xxxxxxxxx","xxxxxxxxx","2694000,2694015,","tczew.multibox@martessport.com.pl"]
[26010011,"WE",260190909,"xxxxxxxxx","xxxxxxxxx","2694000,2694015,","staszow@martessport.com.pl"]
[26010011,"WE",260190582,"xxxxxxxxx","xxxxxxxxx","2694000,2694015,","gdansk.morena@martessport.com.pl"]
[26010011,"WE",260190611,"xxxxxxxxx","xxxxxxxxx","2694000,2694015,","jaroslaw@martessport.com.pl"]
[26010011,"WE",260190596,"xxxxxxxxx","xxxxxxxxx","2694000,2694015,","minskmazowiecki@martessport.com.pl"]
[26010011,"WE",260190691,"xxxxxxxxx","xxxxxxxxx","2694000,2694015,","sokolowpodlaski@martessport.com.pl"]
[26010011,"WE",260190594,"xxxxxxxxx","xxxxxxxxx","2694000,2694015,","krasnystaw@martessport.com.pl"]
[26010011,"WE",260190660,"xxxxxxxxx","xxxxxxxxx","2694000,2694015,","prerov@martessport.com.pl"]
[26010011,"WE",260190579,"xxxxxxxxx","xxxxxxxxx","2694000,2694015,","liberec@martessport.com.pl"]
[26010011,"WE",260190728,"xxxxxxxxx","xxxxxxxxx","2694000,2694015,","kety@martessport.com.pl"]
[26010011,"WE",260191013,"xxxxxxxxx","xxxxxxxxx","2694000,2694015,","chelm.galeriachelm@martessport.com.pl"]
[26010011,"WE",260191010,"xxxxxxxxx","xxxxxxxxx","2694000,2694015,","myslenice@martessport.com.pl"]
[26010011,"WE",260190880,"xxxxxxxxx","xxxxxxxxx","2694000,2694015,"]
[26010011,"WE",260190918,"xxxxxxxxx","xxxxxxxxx","2694000,2694015,","radzymin@martessport.com.pl"]
[26010011,"WE",260191101,"xxxxxxxxx","xxxxxxxxx","2694000,2694015,","ro04_miercureaciuc@martessport.com.pl"]
[26010011,"WE",260190981,"xxxxxxxxx","xxxxxxxxx","2694000,2694015,","plonsk.multibox@martessport.com.pl"]
[26010011,"WE",260190974,"xxxxxxxxx","xxxxxxxxx","2694000,2694015,","ro01_curteadearges@martessport.com.pl"]
[26010011,"WE",260191014,"xxxxxxxxx","xxxxxxxxx","2694000,2694015,","siedlce.stopshop@martessport.com.pl"]
[26010011,"WE",260191012,"xxxxxxxxx","xxxxxxxxx","2694000,2694015,","jawor@martessport.com.pl"]
[26010011,"WE",260191158,"xxxxxxxxx","xxxxxxxxx","2694000,2694015,"]
[26010011,"WE",260191157,"xxxxxxxxx","xxxxxxxxx","2694000,2694015,","zabkowiceslaskie@martessport.com.pl"]
[26010808,"WE",260191126,"xxxxxxxxx","xxxxxxxxx","2694000,2694025,","tomek@mastertenis.pl"]
[26010160,"WE",260190480,"xxxxxxxxx","xxxxxxxxx","2694000,2694017,","maxxsport@maxxsport.com.pl"]
[26010432,"WE",260190245,"xxxxxxxxx","xxxxxxxxx","2694000,2694025,","sklep@halatenisowa.pl"]
[26010432,"WE",260190913,"xxxxxxxxx","xxxxxxxxx","2694000,2694025,","info@mcksport.pl"]
[26010173,"WE",260190235,"xxxxxxxxx","xxxxxxxxx","2694000,2694025,","sklep@mcourt.pl"]
[26010173,"WE",260191037,"xxxxxxxxx","xxxxxxxxx","2694000,2694025,","sklep@mcourt.pl"]
[26010665,"WE",260191315,"xxxxxxxxx","xxxxxxxxx","2694000,2694015,","dj@mjst.pl"]
[26011868,"WE",260191191,"xxxxxxxxx","xxxxxxxxx","2694000,2694050,","pafko@interia.pl"]
[26011304,"WE",260190993,"xxxxxxxxx","xxxxxxxxx","2694000,2694016,","invoice@eobuwie.com.pl"]
[26011304,"WE",260191187,"xxxxxxxxx","xxxxxxxxx","2694000,2694016,","info@modivo.pl"]
[26011514,"WE",260190987,"xxxxxxxxx","xxxxxxxxx","2694000,2694015,","mg@monckcustom.com"]
[26010351,"WE",260190528,"xxxxxxxxx","xxxxxxxxx","2694000,2694017,"]
[26011231,"WE",260190793,"xxxxxxxxx","xxxxxxxxx","2694000,2694017,","kubabc1@yahoo.com"]
[26010185,"WE",260190440,"xxxxxxxxx","xxxxxxxxx","2694000,2694016,","muszak@muszakski.com.pl"]
[26012128,"WE",260191361,"xxxxxxxxx","xxxxxxxxx","2694000,2694025,","mac.brzeski@gmail.com"]
[26010329,"WE",260190024,"xxxxxxxxx","xxxxxxxxx","2694000,2694016,"]
[26010761,"WE",260190790,"xxxxxxxxx","xxxxxxxxx","2694000,2694017,","Maciej.Sowinski@teva.pl"]
[26010915,"WE",260190640,"xxxxxxxxx","xxxxxxxxx","2694000,2694017,"]
[26011304,"WE",260191241,"xxxxxxxxx","xxxxxxxxx","2694000,2694016,","invoice@eobuwie.com.pl"]
[26010011,"WE",260191170,"xxxxxxxxx","xxxxxxxxx","2694000,2694015,"]
[26011696,"WE",260191090,"xxxxxxxxx","xxxxxxxxx","2694000,2694016,"]
[26011164,"WE",260190950,"xxxxxxxxx","xxxxxxxxx","2694000,2694050,","madziaw@hotmail.com"]
[26010271,"WE",260190014,"xxxxxxxxx","xxxxxxxxx","2694000,2694015,","zbigniew.piechal@makro.pl"]
[26010271,"WE",260190032,"xxxxxxxxx","xxxxxxxxx","2694000,2694015,","artur.krepsztul@makro.pl"]
[26010271,"WE",260190033,"xxxxxxxxx","xxxxxxxxx","2694000,2694015,","tomasz.serwin@makro.pl"]
[26010271,"WE",260190034,"xxxxxxxxx","xxxxxxxxx","2694000,2694015,","anita.stylec@makro.pl"]
[26010271,"WE",260190035,"xxxxxxxxx","xxxxxxxxx","2694000,2694015,","jacek.konieczny@makro.pl"]
[26010271,"WE",260190036,"xxxxxxxxx","xxxxxxxxx","2694000,2694015,","tomasz.pietrzak@makro.pl"]
[26010271,"WE",260190037,"xxxxxxxxx","xxxxxxxxx","2694000,2694015,","sylwia.malchar@makro.pl"]
[26010271,"WE",260190038,"xxxxxxxxx","xxxxxxxxx","2694000,2694015,","maciej.leonik@makro.pl"]
[26010271,"WE",260190039,"xxxxxxxxx","xxxxxxxxx","2694000,2694015,","dariusz.stano@makro.pl"]
[26010271,"WE",260190040,"xxxxxxxxx","xxxxxxxxx","2694000,2694015,","artur.beben@makro.pl"]
[26010271,"WE",260190041,"xxxxxxxxx","xxxxxxxxx","2694000,2694015,","rafal.szmydt@makro.pl"]
[26010271,"WE",260190025,"xxxxxxxxx","xxxxxxxxx","2694000,2694015,","marcin.jagla@makro.pl"]
[26010271,"WE",260190042,"xxxxxxxxx","xxxxxxxxx","2694000,2694015,","tomasz.stepien@makro.pl"]
[26010271,"WE",260190043,"xxxxxxxxx","xxxxxxxxx","2694000,2694015,","joanna.kolesnicka@makro.pl"]
[26010271,"WE",260190044,"xxxxxxxxx","xxxxxxxxx","2694000,2694015,","szymon.zielinski@makro.pl"]
[26010271,"WE",260190045,"xxxxxxxxx","xxxxxxxxx","2694000,2694015,","dariusz.kozlowski@makro.pl"]
[26010271,"WE",260190046,"xxxxxxxxx","xxxxxxxxx","2694000,2694015,","agnieszka.kruk@makro.pl"]
[26010271,"WE",260190047,"xxxxxxxxx","xxxxxxxxx","2694000,2694015,","agnieszka.janik@makro.pl"]
[26010271,"WE",260190048,"xxxxxxxxx","xxxxxxxxx","2694000,2694015,","michal.pietrzyk@makro.pl"]
[26010271,"WE",260190049,"xxxxxxxxx","xxxxxxxxx","2694000,2694015,","joanna.laszewska@makro.pl"]
[26010271,"WE",260190050,"xxxxxxxxx","xxxxxxxxx","2694000,2694015,","jacek.winiarski@makro.pl"]
[26010271,"WE",260190051,"xxxxxxxxx","xxxxxxxxx","2694000,2694015,","slawomir.sulima@makro.pl"]
[26010271,"WE",260190026,"xxxxxxxxx","xxxxxxxxx","2694000,2694015,","przemyslaw.palczynski@makro.pl"]
[26010271,"WE",260190052,"xxxxxxxxx","xxxxxxxxx","2694000,2694015,","jacek.markowski@makro.pl"]
[26010271,"WE",260190053,"xxxxxxxxx","xxxxxxxxx","2694000,2694015,","szymon.lelito@makro.pl"]
[26010271,"WE",260190027,"xxxxxxxxx","xxxxxxxxx","2694000,2694015,","agnieszka.malicka@makro.pl"]
[26010271,"WE",260190028,"xxxxxxxxx","xxxxxxxxx","2694000,2694015,","miroslaw.medynski@makro.pl"]
[26010271,"WE",260190029,"xxxxxxxxx","xxxxxxxxx","2694000,2694015,","agnieszka.klimek@makro.pl"]
[26010271,"WE",260190030,"xxxxxxxxx","xxxxxxxxx","2694000,2694015,","katarzyna.kowalewska@makro.pl"]
[26010271,"WE",260190031,"xxxxxxxxx","xxxxxxxxx","2694000,2694015,","pawel.gadek@makro.pl"]
[26012061,"WE",260191311,"xxxxxxxxx","xxxxxxxxx","2694000,2694025,"]
[26010733,"WE",260190516,"xxxxxxxxx","xxxxxxxxx","2694000,2694025,","marek.wojnarski@gmail.com"]
[26010733,"WE",260190515,"xxxxxxxxx","xxxxxxxxx","2694000,2694025,","marek.wojnarski@gmail.com"]
[26012066,"WE",26010081,"xxxxxxxxx","xxxxxxxxx","2694000,2694016,","klusyhd@o2.pl"]
[26011548,"WE",260190989,"xxxxxxxxx","xxxxxxxxx","2694000,2694016,","info@podroze4x4.pl"]
[26011622,"WE",260191050,"xxxxxxxxx","xxxxxxxxx","2694000,2694025,"]
[26010011,"WE",260190986,"xxxxxxxxx","xxxxxxxxx","2694000,2694015,","ro03_timicircumvalatiunii@martessport.com.pl"]
[26010011,"WE",260191071,"xxxxxxxxx","xxxxxxxxx","2694000,2694015,","lukow@martessport.com.pl"]
[26010011,"WE",260191109,"xxxxxxxxx","xxxxxxxxx","2694000,2694015,","mysliborz@martessport.com.pl"]
[26010011,"WE",260191284,"xxxxxxxxx","xxxxxxxxx","2694000,2694015,","kolo@martessport.com.pl"]
[26010011,"WE",260191139,"xxxxxxxxx","xxxxxxxxx","2694000,2694015,"]
[26010011,"WE",260191138,"xxxxxxxxx","xxxxxxxxx","2694000,2694015,"]
[26010011,"WE",260190900,"xxxxxxxxx","xxxxxxxxx","2694000,2694015,","bydgoszcz.outletcenter@martessport.com.pl"]
[26010011,"WE",260191106,"xxxxxxxxx","xxxxxxxxx","2694000,2694015,","naklo@martessport.com.pl"]
[26010011,"WE",260190899,"xxxxxxxxx","xxxxxxxxx","2694000,2694015,","bialystok.outletmartes@martessport.com.pl"]
[26010011,"WE",260191206,"xxxxxxxxx","xxxxxxxxx","2694000,2694015,","sierpc@martessport.com.pl"]
[26010011,"WE",260191283,"xxxxxxxxx","xxxxxxxxx","2694000,2694015,","klodzko2@martessport.com.pl"]
[26010011,"WE",260191281,"xxxxxxxxx","xxxxxxxxx","2694000,2694015,","ilawa.erapark@martessport.com.pl"]
[26010011,"WE",260191272,"xxxxxxxxx","xxxxxxxxx","2694000,2694015,","wagrowiec@martessport.com.pl"]
[26010011,"WE",260191068,"xxxxxxxxx","xxxxxxxxx","2694000,2694015,","barlinek@martessport.com.pl"]
[26010011,"WE",260191105,"xxxxxxxxx","xxxxxxxxx","2694000,2694015,","wladyslawowo@martessport.com.pl"]
[26010011,"WE",260191280,"xxxxxxxxx","xxxxxxxxx","2694000,2694015,","zambrow.vendo@martessport.com.pl"]
[26010011,"WE",260191210,"xxxxxxxxx","xxxxxxxxx","2694000,2694015,","pszczyna@martessport.com.pl"]
[26010011,"WE",260191208,"xxxxxxxxx","xxxxxxxxx","2694000,2694015,","buskozdroj@martessport.com.pl"]
[26010011,"WE",260191066,"xxxxxxxxx","xxxxxxxxx","2694000,2694015,","elk.karuzela@martessport.com.pl"]
[26010011,"WE",260191274,"xxxxxxxxx","xxxxxxxxx","2694000,2694015,","kolobrzeg.karuzela@martessport.com.pl"]
[26010011,"WE",260191198,"xxxxxxxxx","xxxxxxxxx","2694000,2694015,","szamotuly2@martessport.com.pl"]
[26010011,"WE",260191209,"xxxxxxxxx","xxxxxxxxx","2694000,2694015,","pulawy.karuzela@martessport.com.pl"]
[26010011,"WE",260191067,"xxxxxxxxx","xxxxxxxxx","2694000,2694015,","bytow@martessport.com.pl"]
[26010011,"WE",260191265,"xxxxxxxxx","xxxxxxxxx","2694000,2694015,","skarzysko.vendopark@martessport.com.pl"]
[26010011,"WE",260191196,"xxxxxxxxx","xxxxxxxxx","2694000,2694015,","andrychow@martessport.com.pl"]
[26010011,"WE",260191282,"xxxxxxxxx","xxxxxxxxx","2694000,2694015,","klodzko2@martessport.com.pl"]
[26010011,"WE",260191332,"xxxxxxxxx","xxxxxxxxx","2694000,2694015,","ostrzeszow@martessport.com.pl"]
[26010011,"WE",260191110,"xxxxxxxxx","xxxxxxxxx","2694000,2694015,","nowytarg.stopiak@martessport.com.pl"]
[26010011,"WE",260191065,"xxxxxxxxx","xxxxxxxxx","2694000,2694015,","strzelceopolskie@martessport.com.pl"]
[26010011,"WE",260191201,"xxxxxxxxx","xxxxxxxxx","2694000,2694015,","leczna@martessport.com.pl"]
[26010011,"WE",260190898,"xxxxxxxxx","xxxxxxxxx","2694000,2694015,","lublin.outletmartes@martessport.com.pl"]
[26010011,"WE",260191277,"xxxxxxxxx","xxxxxxxxx","2694000,2694015,","suchabeskidzka@martessport.com.pl"]
[26010011,"WE",260191270,"xxxxxxxxx","xxxxxxxxx","2694000,2694015,","wschowa@martessport.com.pl"]
[26010011,"WE",260191069,"xxxxxxxxx","xxxxxxxxx","2694000,2694015,","czestochowa.vendo@martessport.com.pl"]
[26010011,"WE",260191108,"xxxxxxxxx","xxxxxxxxx","2694000,2694015,","lidzbark@martessport.com.pl"]
[26010011,"WE",260191197,"xxxxxxxxx","xxxxxxxxx","2694000,2694015,","prudnik@martessport.com.pl"]
[26010011,"WE",260191291,"xxxxxxxxx","xxxxxxxxx","2694000,2694015,","slawno@martessport.com.pl"]
[26010011,"WE",260191267,"xxxxxxxxx","xxxxxxxxx","2694000,2694015,","ozorkow@martessport.com.pl"]
[26010011,"WE",260191331,"xxxxxxxxx","xxxxxxxxx","2694000,2694015,","dzierzoniow2@martessport.com.pl"]
[26010011,"WE",260191107,"xxxxxxxxx","xxxxxxxxx","2694000,2694015,","jedrzejow@martessport.com.pl"]
[26010011,"WE",260191207,"xxxxxxxxx","xxxxxxxxx","2694000,2694015,","golubdobrzyn@martessport.com.pl"]
[26010011,"WE",260191111,"xxxxxxxxx","xxxxxxxxx","2694000,2694015,","brzesko@martessport.com.pl"]
[26010011,"WE",260191199,"xxxxxxxxx","xxxxxxxxx","2694000,2694015,","rembertow@martessport.com.pl"]
[26010011,"WE",260191269,"xxxxxxxxx","xxxxxxxxx","2694000,2694015,","zielonagora.stopshop@martessport.com.pl"]
[26010011,"WE",260191057,"xxxxxxxxx","xxxxxxxxx","2694000,2694015,","krotoszyn@martessport.com.pl"]
[26010011,"WE",260191202,"xxxxxxxxx","xxxxxxxxx","2694000,2694015,","swiebodzin@martessport.com.pl"]
[26010011,"WE",260191211,"xxxxxxxxx","xxxxxxxxx","2694000,2694015,","ustka@martessport.com.pl"]
[26010011,"WE",260191266,"xxxxxxxxx","xxxxxxxxx","2694000,2694015,","lubawa@martessport.com.pl"]
[26010011,"WE",260191279,"xxxxxxxxx","xxxxxxxxx","2694000,2694015,","garwolin@martessport.com.pl"]
[26010011,"WE",260191271,"xxxxxxxxx","xxxxxxxxx","2694000,2694015,","brzozow@martessport.com.pl"]
[26010011,"WE",260191285,"xxxxxxxxx","xxxxxxxxx","2694000,2694015,","radzionkow@martessport.com.pl"]
[26010011,"WE",260191203,"xxxxxxxxx","xxxxxxxxx","2694000,2694015,","sedziszow@martessport.com.pl"]
[26010011,"WE",260191333,"xxxxxxxxx","xxxxxxxxx","2694000,2694015,","lapy@martessport.com.pl"]
[26010011,"WE",260191278,"xxxxxxxxx","xxxxxxxxx","2694000,2694015,","bielawa@martessport.com.pl"]
[26010011,"WE",260191205,"xxxxxxxxx","xxxxxxxxx","2694000,2694015,","walcz@martessport.com.pl"]
[26010011,"WE",260191200,"xxxxxxxxx","xxxxxxxxx","2694000,2694015,","lubsko@martessport.com.pl"]
[26010011,"WE",260191275,"xxxxxxxxx","xxxxxxxxx","2694000,2694015,","zlotowo@martessport.com.pl"]
[26010011,"WE",260191059,"xxxxxxxxx","xxxxxxxxx","2694000,2694015,","augustow@martessport.com.pl"]
[26010011,"WE",260191137,"xxxxxxxxx","xxxxxxxxx","2694000,2694015,","limanowa@martessport.com.pl"]
[26010011,"WE",260191183,"xxxxxxxxx","xxxxxxxxx","2694000,2694015,","tuchola@martessport.com.pl"]
[26010011,"WE",260191276,"xxxxxxxxx","xxxxxxxxx","2694000,2694015,","lidzbarkwelski@martessport.com.pl"]
[26010011,"WE",260191204,"xxxxxxxxx","xxxxxxxxx","2694000,2694015,","dobremiasto@martessport.com.pl"]
[26010011,"WE",260191056,"xxxxxxxxx","xxxxxxxxx","2694000,2694015,","malbork2@martessport.com.pl"]
[26010011,"WE",260191290,"xxxxxxxxx","xxxxxxxxx","2694000,2694015,","chrudim@martessport.com.pl"]
[26010011,"WE",260191334,"xxxxxxxxx","xxxxxxxxx","2694000,2694015,","jaslo2@martessport.com.pl"]
[26010011,"WE",260191070,"xxxxxxxxx","xxxxxxxxx","2694000,2694015,","nysa.dekada@martessport.com.pl"]
[26010011,"WE",260190982,"xxxxxxxxx","xxxxxxxxx","2694000,2694015,"]
[26010011,"WE",260191053,"xxxxxxxxx","xxxxxxxxx","2694000,2694015,","ro05_oradea@martessport.com.pl"]
[26010011,"WE",260191273,"xxxxxxxxx","xxxxxxxxx","2694000,2694015,","prabuty@martessport.com.pl"]
[26010011,"WE",260191072,"xxxxxxxxx","xxxxxxxxx","2694000,2694015,","wladyslawowo@martessport.com.pl"]
[26010011,"WE",260191102,"xxxxxxxxx","xxxxxxxxx","2694000,2694015,"]
[26010011,"WE",260191223,"xxxxxxxxx","xxxxxxxxx","2694000,2694015,","otwock.vendopark@martessport.com.pl"]
[26010290,"WE",260190360,"xxxxxxxxx","xxxxxxxxx","2694000,2694016,","mbucki@insolutions.pl"]
[26011906,"WE",260191215,"xxxxxxxxx","xxxxxxxxx","2694000,2694025,"]
[26012031,"WE",260191294,"xxxxxxxxx","xxxxxxxxx","2694000,2694025,","michalnispon@gmail.com"]
[26012104,"WE",260191294,"xxxxxxxxx","xxxxxxxxx","2694000,2694025,","michalnispon@gmail.com"]
[26011767,"WE",260191125,"xxxxxxxxx","xxxxxxxxx","2694000,2694050,","michal@piechowicz.pl"]
[26011006,"WE",260190673,"xxxxxxxxx","xxxxxxxxx","2694000,2694025,"]
[26011023,"WE",260190827,"xxxxxxxxx","xxxxxxxxx","2694000,2694016,","mikosport1@o2.pl"]
[26010113,"WE",260190020,"xxxxxxxxx","xxxxxxxxx","2694000,2694025,"]
[26011339,"WE",260190925,"xxxxxxxxx","xxxxxxxxx","2694000,2694016,","d.niemczu@gmail.com"]
[26011954,"WE",260191224,"xxxxxxxxx","xxxxxxxxx","2694000,2694017,"]
[26010106,"WE",260190468,"xxxxxxxxx","xxxxxxxxx","2694000,2694017,","sklep@nartykrakow.pl"]
[26010251,"WE",260190459,"xxxxxxxxx","xxxxxxxxx","2694000,2694017,","sklep@nartywarszawa.pl"]
[26011997,"WE",260191250,"xxxxxxxxx","xxxxxxxxx","2694000,2694017,","agapotocka@ndsport.pl"]
[26010866,"WE",260190619,"xxxxxxxxx","xxxxxxxxx","2694000,2694025,","dariusz.zajac@njntravel.pl"]
[26010264,"WE",260190555,"xxxxxxxxx","xxxxxxxxx","2694000,2694016,","biuro@nova.szczyrk.pl"]
[26010506,"WE",260190535,"xxxxxxxxx","xxxxxxxxx","2694000,2694017,","serwis@superserwisntn.pl"]
[26011246,"WE",260191232,"xxxxxxxxx","xxxxxxxxx","2694000,2694016,","remikslawik@o2.pl"]
[26010846,"WE",260190751,"xxxxxxxxx","xxxxxxxxx","2694000,2694017,","nartyolsztyn@wp.pl"]
[26010057,"WE",260190215,"xxxxxxxxx","xxxxxxxxx","2694000,2694025,","sklep@novasport.pl"]
[26010316,"WE",260190090,"xxxxxxxxx","xxxxxxxxx","2694000,2694017,"]
[26011796,"WE",260191151,"xxxxxxxxx","xxxxxxxxx","2694000,2694016,","szymanski.janusz@gmail.com"]
[26011257,"WE",260190901,"xxxxxxxxx","xxxxxxxxx","2694000,2694025,"]
[26011170,"WE",260190780,"xxxxxxxxx","xxxxxxxxx","2694000,2694025,","grzegorz.jednaki@smolecsport.pl"]
[26011993,"WE",260191159,"xxxxxxxxx","xxxxxxxxx","2694000,2694016,","frente68@op.pl"]
[26011814,"WE",260191159,"xxxxxxxxx","xxxxxxxxx","2694000,2694016,","frente68@op.pl"]
[26011961,"WE",260191240,"xxxxxxxxx","xxxxxxxxx","2694000,2694016,","biuro@vip-ski.pl"]
[26011962,"WE",260191240,"xxxxxxxxx","xxxxxxxxx","2694000,2694016,","biuro@vip-ski.pl"]
[26010042,"WE",260191240,"xxxxxxxxx","xxxxxxxxx","2694000,2694016,","biuro@vip-ski.pl"]
[26011004,"WE",260190988,"xxxxxxxxx","xxxxxxxxx","2694000,2694025,"]
[26012004,"WE",260191260,"xxxxxxxxx","xxxxxxxxx","2694000,2694025,","mikolajlew@icloud.com"]
[26010172,"WE",260190507,"xxxxxxxxx","xxxxxxxxx","2694000,2694017,","info@protenis.com.pl"]
[26010172,"WE",260190010,"xxxxxxxxx","xxxxxxxxx","2694000,2694017,","m.lutkowska@protenis.com.pl"]
[26012007,"WE",260191255,"xxxxxxxxx","xxxxxxxxx","2694000,2694025,","hello@padlovnia.pl"]
[26010236,"WE",260191168,"xxxxxxxxx","xxxxxxxxx","2694000,2694025,","b2b@sport-shop.pl"]
[26011876,"WE",260191321,"xxxxxxxxx","xxxxxxxxx","2694000,2694025,","mariusz.wlodarczyk@stamarw.com.pl"]
[26011747,"WE",260191103,"xxxxxxxxx","xxxxxxxxx","2694000,2694025,","patmaj91@gmail.com"]
[26010552,"WE",260191145,"xxxxxxxxx","xxxxxxxxx","2694000,2694015,","m.drzyzgiewicz@pl.head.com"]
[26012105,"WE",260191335,"xxxxxxxxx","xxxxxxxxx","2694000,2694016,","kontakt@ski-raft.pl"]
[26011019,"WE",260190817,"xxxxxxxxx","xxxxxxxxx","2694000,2694025,","sklep@peakstore.pl"]
[26010687,"WE",260190580,"xxxxxxxxx","xxxxxxxxx","2694000,2694025,","p.bondyra@onet.pl"]
[26010149,"WE",260190634,"xxxxxxxxx","xxxxxxxxx","2694000,2694017,"]
[26012111,"WE",260191347,"xxxxxxxxx","xxxxxxxxx","2694000,2694017,","info@szkolajaworzyna.pl"]
[26011610,"WE",260191128,"xxxxxxxxx","xxxxxxxxx","2694000,2694025,","piotr_tennis@o2.pl"]
[26011236,"WE",260191135,"xxxxxxxxx","xxxxxxxxx","2694000,2694016,","kna-dzikowiec@wp.pl"]
[26011031,"WE",260190681,"xxxxxxxxx","xxxxxxxxx","2694000,2694025,","piotrszumilewicz@gmail.com"]
[26011428,"WE",260190939,"xxxxxxxxx","xxxxxxxxx","2694000,2694025,","biuro@pointsportclub.pl"]
[26010471,"WE",260190271,"xxxxxxxxx","xxxxxxxxx","2694000,2694025,","prince-sport@go2.pl"]
[26010931,"WE",260190630,"xxxxxxxxx","xxxxxxxxx","2694000,2694025,","sklep@pro.shop.pl"]
[26011190,"WE",260190930,"xxxxxxxxx","xxxxxxxxx","2694000,2694025,"]
[26010964,"WE",260190800,"xxxxxxxxx","xxxxxxxxx","2694000,2694025,","kontakt@profistyle.pl"]
[26011088,"WE",260190719,"xxxxxxxxx","xxxxxxxxx","2694000,2694025,"]
[26011221,"WE",260190786,"xxxxxxxxx","xxxxxxxxx","2694000,2694017,","tomaszbabiak@yahoo.pl"]
[26011354,"WE",260190911,"xxxxxxxxx","xxxxxxxxx","2694000,2694016,"]
[26010093,"WE",260190551,"xxxxxxxxx","xxxxxxxxx","2694000,2694016,","przemyslav.novak@gmail.com"]
[26010044,"WE",260190534,"xxxxxxxxx","xxxxxxxxx","2694000,2694016,","info@qbasport.pl"]
[26010737,"WE",260190627,"xxxxxxxxx","xxxxxxxxx","2694000,2694017,"]
[26010238,"WE",260191076,"xxxxxxxxx","xxxxxxxxx","2694000,2694016,"]
[26010544,"WE",260190317,"xxxxxxxxx","xxxxxxxxx","2694000,2694025,","Marcin.Klosowski@R-GOL.com"]
[26011359,"WE",260191038,"xxxxxxxxx","xxxxxxxxx","2694000,2694025,","radekgrze@onet.eu"]
[26010872,"WE",260191312,"xxxxxxxxx","xxxxxxxxx","2694000,2694025,","lukaszjuzwa@gmail.com"]
[26011359,"WE",260191221,"xxxxxxxxx","xxxxxxxxx","2694000,2694025,","radekgrze@onet.eu"]
[26010934,"WE",260191025,"xxxxxxxxx","xxxxxxxxx","2694000,2694025,","rafal.kilijanski@gmail.com"]
[26011784,"WE",260191129,"xxxxxxxxx","xxxxxxxxx","2694000,2694016,","roman@rajbiski.szczyrk.pl"]
[26010295,"WE",260190021,"xxxxxxxxx","xxxxxxxxx","2694000,2694017,"]
[26010675,"WE",260191301,"xxxxxxxxx","xxxxxxxxx","2694000,2694025,","tukszdun@gmail.com"]
[26011066,"WE",260191041,"xxxxxxxxx","xxxxxxxxx","2694000,2694016,"]
[26011434,"WE",260190932,"xxxxxxxxx","xxxxxxxxx","2694000,2694025,","recepcja@tenisrudawa.pl"]
[26011352,"WE",260190906,"xxxxxxxxx","xxxxxxxxx","2694000,2694017,","kontakt@saysport.pl"]
[26010032,"WE",260190443,"xxxxxxxxx","xxxxxxxxx","2694000,2694016,","kontakt@24tanienarty.pl"]
[26010421,"WE",260190474,"xxxxxxxxx","xxxxxxxxx","2694000,2694017,","sklep@skifanatic.pl"]
[26010419,"WE",260190475,"xxxxxxxxx","xxxxxxxxx","2694000,2694017,","skipark@onet.pl"]
[26011040,"WE",260191325,"xxxxxxxxx","xxxxxxxxx","2694000,2694016,","info@ski-planet.pl"]
[26011040,"WE",260191155,"xxxxxxxxx","xxxxxxxxx","2694000,2694016,","info@ski-planet.pl"]
[26010509,"WE",260190671,"xxxxxxxxx","xxxxxxxxx","2694000,2694017,","skirace@skirace.pl"]
[26010131,"WE",260190453,"xxxxxxxxx","xxxxxxxxx","2694000,2694017,"]
[26011124,"WE",260190743,"xxxxxxxxx","xxxxxxxxx","2694000,2694017,","katowice.biuro@skiteam.pl"]
[26011124,"WE",260190741,"xxxxxxxxx","xxxxxxxxx","2694000,2694017,","poznan.biuro@skiteam.pl"]
[26011124,"WE",260190742,"xxxxxxxxx","xxxxxxxxx","2694000,2694017,","arkady.biuro@skiteam.pl"]
[26011124,"WE",260190740,"xxxxxxxxx","xxxxxxxxx","2694000,2694017,","karolkowa.biuro@skiteam.pl"]
[26011124,"WE",260190729,"xxxxxxxxx","xxxxxxxxx","2694000,2694017,","sklepw1.biuro@skiteam.pl"]
[26011124,"WE",260190902,"xxxxxxxxx","xxxxxxxxx","2694000,2694017,","bialoleka.biuro@skiteam.pl"]
[26011124,"WE",260191104,"xxxxxxxxx","xxxxxxxxx","2694000,2694017,","katowice.biuro@skiteam.pl"]
[26011124,"WE",260190998,"xxxxxxxxx","xxxxxxxxx","2694000,2694017,","eryk@skiteam.pl"]
[26010008,"WE",260190455,"xxxxxxxxx","xxxxxxxxx","2694000,2694016,","info@ski-boot-service.pl"]
[26011208,"WE",260190832,"xxxxxxxxx","xxxxxxxxx","2694000,2694016,","skibikesport@gmail.com"]
[26010012,"WE",260190446,"xxxxxxxxx","xxxxxxxxx","2694000,2694016,","ski.sport@vp.pl"]
[26011409,"WE",260190924,"xxxxxxxxx","xxxxxxxxx","2694000,2694016,","wklis05@gmail.com"]
[26011126,"WE",260190442,"xxxxxxxxx","xxxxxxxxx","2694000,2694016,","biuro@ski4you.pl"]
[26010032,"WE",260190117,"xxxxxxxxx","xxxxxxxxx","2694000,2694016,"]
[26010106,"WE",260190865,"xxxxxxxxx","xxxxxxxxx","2694000,2694017,","sklep@nartykrakow.pl"]
[26011576,"WE",260191035,"xxxxxxxxx","xxxxxxxxx","2694000,2694016,","sklep@skiland.pl"]
[26010456,"WE",260190253,"xxxxxxxxx","xxxxxxxxx","2694000,2694025,"]
[26011396,"WE",260190923,"xxxxxxxxx","xxxxxxxxx","2694000,2694017,"]
[26010417,"WE",260190509,"xxxxxxxxx","xxxxxxxxx","2694000,2694017,","biuro@smjsport.pl"]
[26010244,"WE",260190472,"xxxxxxxxx","xxxxxxxxx","2694000,2694017,","info@snowandsurf.pl"]
[26010255,"WE",260190575,"xxxxxxxxx","xxxxxxxxx","2694000,2694017,","info@snowshop.pl"]
[26010255,"WE",260190919,"xxxxxxxxx","xxxxxxxxx","2694000,2694017,","info@sportsalon.pl"]
[26010255,"WE",260190458,"xxxxxxxxx","xxxxxxxxx","2694000,2694017,","info@snowshop.pl"]
[26010728,"WE",260190490,"xxxxxxxxx","xxxxxxxxx","2694000,2694016,","sklep@snowsport.pl"]
[26010670,"WE",260190710,"xxxxxxxxx","xxxxxxxxx","2694000,2694017,","speedsport@interia.eu"]
[26010320,"WE",260190456,"xxxxxxxxx","xxxxxxxxx","2694000,2694016,","sport2002@onet.eu"]
[26010223,"WE",260190510,"xxxxxxxxx","xxxxxxxxx","2694000,2694016,","salon@sportclub.com.pl"]
[26011147,"WE",260191130,"xxxxxxxxx","xxxxxxxxx","2694000,2694016,","krzysztofk75@op.pl"]
[26010888,"WE",260190598,"xxxxxxxxx","xxxxxxxxx","2694000,2694025,","manager@sportpark.com.pl"]
[26011748,"WE",260191192,"xxxxxxxxx","xxxxxxxxx","2694000,2694015,","kontakt@sportano.pl"]
[26010048,"WE",260190473,"xxxxxxxxx","xxxxxxxxx","2694000,2694017,","sportland@poczta.onet.pl"]
[26010569,"WE",260190829,"xxxxxxxxx","xxxxxxxxx","2694000,2694016,","jacek@sportmaster.pl"]
[26010569,"WE",260190789,"xxxxxxxxx","xxxxxxxxx","2694000,2694016,"]
[26010517,"WE",260190448,"xxxxxxxxx","xxxxxxxxx","2694000,2694016,","sklep@sportpoint.pl"]
[26010068,"WE",260190115,"xxxxxxxxx","xxxxxxxxx","2694000,2694016,"]
[26010631,"WE",260190522,"xxxxxxxxx","xxxxxxxxx","2694000,2694025,"]
[26010732,"WE",260190519,"xxxxxxxxx","xxxxxxxxx","2694000,2694025,","info@squash.sosnowiec.pl"]
[26011008,"WE",260190937,"xxxxxxxxx","xxxxxxxxx","2694000,2694025,","adam@tenisklub.pl"]
[26010702,"WE",260190850,"xxxxxxxxx","xxxxxxxxx","2694000,2694025,","adam@tenisklub.pl"]
[26011850,"WE",260191330,"xxxxxxxxx","xxxxxxxxx","2694000,2694025,","biuro@silesiapadel.pl"]
[26010637,"WE",260190815,"xxxxxxxxx","xxxxxxxxx","2694000,2694017,","pulawska@strefatenisa.com.pl"]
[26010637,"WE",260190506,"xxxxxxxxx","xxxxxxxxx","2694000,2694017,","bohaterow@strefatenisa.com.pl"]
[26010637,"WE",260191121,"xxxxxxxxx","xxxxxxxxx","2694000,2694017,","sylwestrzak@o2.pl"]
[26010326,"WE",260190491,"xxxxxxxxx","xxxxxxxxx","2694000,2694017,","info@supersklep.pl"]
[26011022,"WE",260190755,"xxxxxxxxx","xxxxxxxxx","2694000,2694017,","surfbaltyk@poczta.onet.pl"]
[26010378,"WE",260190462,"xxxxxxxxx","xxxxxxxxx","2694000,2694017,","info@surfoteka.pl"]
[26011917,"WE",260191115,"xxxxxxxxx","xxxxxxxxx","2694000,2694025,","katarzynapyka1996@gmail.com"]
[26011753,"WE",260191115,"xxxxxxxxx","xxxxxxxxx","2694000,2694025,","katarzynapyka1996@gmail.com"]
[26010979,"WE",260191341,"xxxxxxxxx","xxxxxxxxx","2694000,2694015,","Sebastian.POZNANSKI@danone.com"]
[26010258,"WE",260190229,"xxxxxxxxx","xxxxxxxxx","2694000,2694025,","tomasz.laskowski@poczta.fm"]
[26010203,"WE",260190821,"xxxxxxxxx","xxxxxxxxx","2694000,2694025,","sk-sport@sk-sport.pl"]
[26011586,"WE",260191030,"xxxxxxxxx","xxxxxxxxx","2694000,2694017,","ksiegowosc@skiracecenter.pl"]
[26010499,"WE",260190320,"xxxxxxxxx","xxxxxxxxx","2694000,2694025,"]
[26011555,"WE",260191165,"xxxxxxxxx","xxxxxxxxx","2694000,2694017,","marcin.kapel@o2.pl"]
[26011739,"WE",260191100,"xxxxxxxxx","xxxxxxxxx","2694000,2694025,","poczta@globallsport.pl"]
[26011698,"WE",260191091,"xxxxxxxxx","xxxxxxxxx","2694000,2694025,","sklep@sklepzdeskami.pl"]
[26010273,"WE",260190012,"xxxxxxxxx","xxxxxxxxx","2694000,2694015,"]
[26010032,"WE",260191132,"xxxxxxxxx","xxxxxxxxx","2694000,2694016,","speedfocus@interia.eu"]
[26010670,"WE",260190750,"xxxxxxxxx","xxxxxxxxx","2694000,2694017,","speedsport@interia.eu"]
[26010421,"WE",260190223,"xxxxxxxxx","xxxxxxxxx","2694000,2694017,"]
[26010162,"WE",260190465,"xxxxxxxxx","xxxxxxxxx","2694000,2694017,","sport@deregowski.pl"]
[26010214,"WE",260190822,"xxxxxxxxx","xxxxxxxxx","2694000,2694025,","info@sportshop.pl"]
[26011748,"WE",260191113,"xxxxxxxxx","xxxxxxxxx","2694000,2694015,","INBOUND@SCOMMERCE.ONE"]
[26010179,"WE",260190015,"xxxxxxxxx","xxxxxxxxx","2694000,2694025,"]
[26011665,"WE",260191081,"xxxxxxxxx","xxxxxxxxx","2694000,2694025,"]
[26010124,"WE",260190323,"xxxxxxxxx","xxxxxxxxx","2694000,2694016,","kbarczak@sporting.com.pl"]
[26011667,"WE",260191060,"xxxxxxxxx","xxxxxxxxx","2694000,2694025,","piotr.kolasa@sportszok.pl"]
[26010740,"WE",260190502,"xxxxxxxxx","xxxxxxxxx","2694000,2694025,"]
[26011424,"WE",260190931,"xxxxxxxxx","xxxxxxxxx","2694000,2694025,","slazik@wp.pl"]
[26010619,"WE",260190341,"xxxxxxxxx","xxxxxxxxx","2694000,2694025,"]
[26010699,"WE",260190380,"xxxxxxxxx","xxxxxxxxx","2694000,2694025,","k.kwosek@gmail.com"]
[26011427,"WE",260190938,"xxxxxxxxx","xxxxxxxxx","2694000,2694025,","info@squashok.pl"]
[26011543,"WE",260190992,"xxxxxxxxx","xxxxxxxxx","2694000,2694025,","adrian.janik@op.pl"]
[26010619,"WE",260190342,"xxxxxxxxx","xxxxxxxxx","2694000,2694025,"]
[26010541,"WE",260191295,"xxxxxxxxx","xxxxxxxxx","2694000,2694017,","w.ziobrowski@op.pl"]
[26010506,"WE",260190255,"xxxxxxxxx","xxxxxxxxx","2694000,2694017,","kontakt@superserwis.ski"]
[26011986,"WE",260191348,"xxxxxxxxx","xxxxxxxxx","2694000,2694016,","biuro@supersportowy.pl"]
[26011163,"WE",260190831,"xxxxxxxxx","xxxxxxxxx","2694000,2694016,","info@supersporty.pl"]
[26010378,"WE",260190224,"xxxxxxxxx","xxxxxxxxx","2694000,2694017,"]
[26010134,"WE",260190410,"xxxxxxxxx","xxxxxxxxx","2694000,2694025,","tomas599@hotmail.com"]
[26012111,"WE",260191346,"xxxxxxxxx","xxxxxxxxx","2694000,2694017,","info@szkolajaworzyna.pl"]
[26010698,"WE",260190363,"xxxxxxxxx","xxxxxxxxx","2694000,2694016,"]
[26010597,"WE",260190335,"xxxxxxxxx","xxxxxxxxx","2694000,2694016,"]
[26011628,"WE",260191185,"xxxxxxxxx","xxxxxxxxx","2694000,2694025,","trener.adriansobczak@gmail.com"]
[26010874,"WE",260190714,"xxxxxxxxx","xxxxxxxxx","2694000,2694025,","szkola@proteniskrakow.pl"]
[26010874,"WE",260190584,"xxxxxxxxx","xxxxxxxxx","2694000,2694025,","szkola@proteniskrakow.pl"]
[26010101,"WE",260191131,"xxxxxxxxx","xxxxxxxxx","2694000,2694016,","elita@elita.krakow.pl"]
[26011745,"WE",260191116,"xxxxxxxxx","xxxxxxxxx","2694000,2694016,","wrobel224@wp.pl"]
[26011745,"WE",260191117,"xxxxxxxxx","xxxxxxxxx","2694000,2694016,","wrobel224@wp.pl"]
[26011370,"WE",260190920,"xxxxxxxxx","xxxxxxxxx","2694000,2694025,","kosicz@poczta.onet.pl"]
[26011664,"WE",260191078,"xxxxxxxxx","xxxxxxxxx","2694000,2694025,"]
[26011009,"WE",260191055,"xxxxxxxxx","xxxxxxxxx","2694000,2694025,","info@sportsystem.pl"]
[26010919,"WE",260190620,"xxxxxxxxx","xxxxxxxxx","2694000,2694025,","sklep@tikasport.pl"]
[26010198,"WE",260190412,"xxxxxxxxx","xxxxxxxxx","2694000,2694016,","info@tirolski.pl"]
[26010949,"WE",260190711,"xxxxxxxxx","xxxxxxxxx","2694000,2694017,","sklep@trojansport.pl"]
[26010369,"WE",260190484,"xxxxxxxxx","xxxxxxxxx","2694000,2694017,","sklep@trojansport.pl"]
[26010949,"WE",260190712,"xxxxxxxxx","xxxxxxxxx","2694000,2694017,","sklep@trojansport.pl"]
[26010369,"WE",260190483,"xxxxxxxxx","xxxxxxxxx","2694000,2694017,","jarek@trojansport.pl"]
[26011032,"WE",260190682,"xxxxxxxxx","xxxxxxxxx","2694000,2694017,","a.wrobel@trybik.pl"]
[26011433,"WE",260191112,"xxxxxxxxx","xxxxxxxxx","2694000,2694025,","biuro@tytan.shop"]
[26010691,"WE",260190553,"xxxxxxxxx","xxxxxxxxx","2694000,2694025,"]
[26011153,"WE",260190888,"xxxxxxxxx","xxxxxxxxx","2694000,2694025,"]
[26010895,"WE",260190613,"xxxxxxxxx","xxxxxxxxx","2694000,2694025,","terminal.charzykowy@gmail.com"]
[26010587,"WE",260190340,"xxxxxxxxx","xxxxxxxxx","2694000,2694016,","robert.metryka@wp.pl"]
[26011678,"WE",260191140,"xxxxxxxxx","xxxxxxxxx","2694000,2694016,","ski.sudety@gmail.com"]
[26011116,"WE",260190738,"xxxxxxxxx","xxxxxxxxx","2694000,2694025,","tmuszer@gmail.com"]
[26010401,"WE",260190222,"xxxxxxxxx","xxxxxxxxx","2694000,2694016,"]
[26011934,"WE",260191230,"xxxxxxxxx","xxxxxxxxx","2694000,2694016,","tomek_wasniowski@tlen.pl"]
[26010191,"WE",260190289,"xxxxxxxxx","xxxxxxxxx","2694000,2694015,"]
[26010191,"WE",260190287,"xxxxxxxxx","xxxxxxxxx","2694000,2694015,"]
[26010191,"WE",260190284,"xxxxxxxxx","xxxxxxxxx","2694000,2694015,"]
[26010191,"WE",260190291,"xxxxxxxxx","xxxxxxxxx","2694000,2694015,"]
[26010191,"WE",260190290,"xxxxxxxxx","xxxxxxxxx","2694000,2694015,"]
[26010191,"WE",260190282,"xxxxxxxxx","xxxxxxxxx","2694000,2694015,"]
[26010191,"WE",260190285,"xxxxxxxxx","xxxxxxxxx","2694000,2694015,"]
[26010191,"WE",260190281,"xxxxxxxxx","xxxxxxxxx","2694000,2694015,"]
[26010191,"WE",260190288,"xxxxxxxxx","xxxxxxxxx","2694000,2694015,"]
[26010191,"WE",260190277,"xxxxxxxxx","xxxxxxxxx","2694000,2694015,"]
[26010191,"WE",260190280,"xxxxxxxxx","xxxxxxxxx","2694000,2694015,"]
[26010191,"WE",260190283,"xxxxxxxxx","xxxxxxxxx","2694000,2694015,"]
[26010191,"WE",260190279,"xxxxxxxxx","xxxxxxxxx","2694000,2694015,"]
[26010191,"WE",260190286,"xxxxxxxxx","xxxxxxxxx","2694000,2694015,"]
[26010191,"WE",260190278,"xxxxxxxxx","xxxxxxxxx","2694000,2694015,"]
[26010191,"WE",260190276,"xxxxxxxxx","xxxxxxxxx","2694000,2694015,"]
[26010134,"WE",260190617,"xxxxxxxxx","xxxxxxxxx","2694000,2694025,","sklep@tygertenis.pl"]
[26011324,"WE",260190936,"xxxxxxxxx","xxxxxxxxx","2694000,2694050,","info@tenis-winner.pl"]
[26010080,"WE",260191092,"xxxxxxxxx","xxxxxxxxx","2694000,2694025,"]
[26011127,"WE",260190737,"xxxxxxxxx","xxxxxxxxx","2694000,2694025,","jacek@domenasportowa.pl"]
[26010003,"WE",260190477,"xxxxxxxxx","xxxxxxxxx","2694000,2694017,","kontakt@wypozyczalnia-nart.com.pl"]
[26010913,"WE",260190642,"xxxxxxxxx","xxxxxxxxx","2694000,2694016,","firmaib.dziedzic@gmail.com"]
[26010450,"WE",260190637,"xxxxxxxxx","xxxxxxxxx","2694000,2694016,","kontakt@sportforever.eu"]
[26010110,"WE",260190487,"xxxxxxxxx","xxxxxxxxx","2694000,2694017,","biuro@windsport.pl"]
[26010149,"WE",260190406,"xxxxxxxxx","xxxxxxxxx","2694000,2694017,","sportszok@sportszok.pl"]
[26011296,"WE",260190860,"xxxxxxxxx","xxxxxxxxx","2694000,2694025,"]
[26011598,"WE",260191032,"xxxxxxxxx","xxxxxxxxx","2694000,2694016,","wojtekbebenek@gmail.com"]
[26010051,"WE",260191172,"xxxxxxxxx","xxxxxxxxx","2694000,2694016,","wojciech@maleccy.com"]
[26010621,"WE",260190543,"xxxxxxxxx","xxxxxxxxx","2694000,2694025,","sklep@wsolsport.pl"]
[26011982,"WE",260191245,"xxxxxxxxx","xxxxxxxxx","2694000,2694016,","lalus78@interia.pl"]
[26011246,"WE",260191074,"xxxxxxxxx","xxxxxxxxx","2694000,2694016,"]
[26010857,"WE",260190668,"xxxxxxxxx","xxxxxxxxx","2694000,2694016,","skipointszklarska@gmail.com"]
[26010042,"WE",260190662,"xxxxxxxxx","xxxxxxxxx","2694000,2694016,","biuro@vip-ski.pl"]
[26010428,"WE",260190537,"xxxxxxxxx","xxxxxxxxx","2694000,2694016,","bujokprzemyslaw@gmail.com"]
[26010780,"WE",260191350,"xxxxxxxxx","xxxxxxxxx","2694000,2694016,","biuro@wintergroup.pl"]
[26010836,"WE",260191156,"xxxxxxxxx","xxxxxxxxx","2694000,2694016,","malinowskijarek@tlen.pl"]
[26010833,"WE",260190626,"xxxxxxxxx","xxxxxxxxx","2694000,2694016,","xsport@x-sport.pl"]
[26010833,"WE",260190646,"xxxxxxxxx","xxxxxxxxx","2694000,2694016,","xsport@x-sport.pl"]
[26011971,"WE",260191262,"xxxxxxxxx","xxxxxxxxx","2694000,2694016,","sklep@xtreme-shop.pl"]
[26011861,"WE",260191190,"xxxxxxxxx","xxxxxxxxx","2694000,2694025,","pzarwanski@gmail.com"]
[26010219,"WE",260190469,"xxxxxxxxx","xxxxxxxxx","2694000,2694017,","sklep@zawojski.pl"]
[26010816,"WE",260191222,"xxxxxxxxx","xxxxxxxxx","2694000,2694025,","mateuszfigas@wp.pl"]
[26011374,"WE",260190921,"xxxxxxxxx","xxxxxxxxx","2694000,2694016,"]
[26011815,"WE",260191227,"xxxxxxxxx","xxxxxxxxx","2694000,2694017,","piotr@dobrenarty.pl"]
[26011526,"WE",260190984,"xxxxxxxxx","xxxxxxxxx","2694000,2694025,","sklep@erakiety.com"]
[26010889,"WE",260190599,"xxxxxxxxx","xxxxxxxxx","2694000,2694016,"]
[26010835,"WE",260190570,"xxxxxxxxx","xxxxxxxxx","2694000,2694025,","mediadwa@astercity.pl"]
[26010831,"WE",260190674,"xxxxxxxxx","xxxxxxxxx","2694000,2694025,","kontakt@skihandlarz.pl"]
[26010648,"WE",260190451,"xxxxxxxxx","xxxxxxxxx","2694000,2694016,","biuro@funsport.com.pl"]
[26010526,"WE",260191031,"xxxxxxxxx","xxxxxxxxx","2694000,2694025,","bok@skleptenisisty.pl"]
[26010236,"WE",260190818,"xxxxxxxxx","xxxxxxxxx","2694000,2694025,","sklep@sport-shop.pl"]
[26011220,"WE",260190830,"xxxxxxxxx","xxxxxxxxx","2694000,2694016,","sportsshop.pl@gmail.com"]
[26010111,"WE",260190508,"xxxxxxxxx","xxxxxxxxx","2694000,2694025,","sklep@tenisista.pl"]
[26010872,"WE",260191235,"xxxxxxxxx","xxxxxxxxx","2694000,2694025,"]
[26011223,"WE",260190866,"xxxxxxxxx","xxxxxxxxx","2694000,2694017,","minsk@swiatnart.com.pl"]
[26011223,"WE",260190787,"xxxxxxxxx","xxxxxxxxx","2694000,2694017,","sklep@swiatnart.com.pl"]
[26011223,"WE",260190881,"xxxxxxxxx","xxxxxxxxx","2694000,2694017,","torun@swiatrowerow.com.pl"]
[26011223,"WE",260190867,"xxxxxxxxx","xxxxxxxxx","2694000,2694017,","zielonka@swiatnart.com.pl"]
[26010922,"WE",260190621,"xxxxxxxxx","xxxxxxxxx","2694000,2694025,","info@centrumtenisa.pl"]
[2694016,"ZO",null,"xxxxxxxxx","xxxxxxxxx",null,"b.gawronski@pl.head.com"]
[2694015,"ZO",null,"xxxxxxxxx","xxxxxxxxx",null,"m.drzyzgiewicz@pl.head.com"]
[2694050,"ZO",null,"xxxxxxxxx","xxxxxxxxx",null,"m.wojdylo@pl.head.com"]
[2694017,"ZO",null,"xxxxxxxxx","xxxxxxxxx",null,"m.popiolek@pl.head.com"]
[2694000,"ZO",null,"xxxxxxxxx","xxxxxxxxx"]
[2694025,"ZO",null,"xxxxxxxxx","xxxxxxxxx",null,"j.stoklosa@pl.head.com"]